{"text_format":"1","workbook":"xlsx","n_sheets":8,"sheets":["Eingabe","Gesamt","NRW-Junior","NRW-Senior","NRW-Elite-XL","NRW-Elite-XL-18","Prog","NRW-Open"],"not_rendered":{"charts":0,"images":0,"macros":1,"external_links":0,"defined_names":7,"comments":1,"pivot_tables":0},"unopened":[{"sheet":"Prog","index":6,"reason":"part_missing"}],"bounds":{"document_bytes":16777216,"sheet_cells":100000,"rows_first":2000,"rows_last":500,"rows_between":2000,"halvings":0,"cell_chars":16384,"cell_head_chars":4096},"cells_cut":0,"cells_raw":0,"read":"whole","date_system":"1900"}

{"sheet":"Eingabe","index":0,"n_rows":22,"n_cols":6,"rows_kept":22,"cut":false,"hidden":true,"merged":[[1,1,1,5],[18,1,18,2],[19,1,19,2],[20,1,20,2],[18,4,18,5],[19,4,19,5],[20,4,20,5]]}
[]
[null,"Zeitmessung Seifenkisten Derby Mettingen"]
[]
[]
[null,"V6.3"]
[null,null,"Bahn 1 PR",null,"Bahn 2 PB"]
[]
[null,"Lauf ",4,null,4]
[]
[null,"Start-Nr",708,709,709]
[]
[null,"Zeit",37.799999999999997,null,37.9]
[]
[null,null,"Hauptlauf / Endlauf  ?",null,"Endlauf"]
[null,"Endlauf-Daten übertragen und gespeichet"]
[null,null,null,null,null,"  "]
[null,{"$f":"LOOKUP(C10,Gesamt!A4:A1000,Gesamt!B4:B1000)","v":"EXL18"},null,null,null,{"$f":"LOOKUP(E10,Gesamt!A4:A1000,Gesamt!B4:B1000)","v":"EXL18"}]
[]
[null,{"$f":"LOOKUP(C10,Gesamt!A4:A1000,Gesamt!E4:E1000)","v":"Dominik"},null,null,{"$f":"LOOKUP(E10,Gesamt!A4:A1000,Gesamt!E4:E1000)","v":"Florian"}]
[null,{"$f":"LOOKUP(C10,Gesamt!A4:A1000,Gesamt!D4:D1000)","v":"Leismann"},null,null,{"$f":"LOOKUP(E10,Gesamt!A4:A1000,Gesamt!D4:D1000)","v":"Lange"}]
[null,{"$f":"LOOKUP(C10,Gesamt!A4:A1000,Gesamt!F4:F1000)","v":"Mettingen"},null,null,{"$f":"LOOKUP(E10,Gesamt!A4:A1000,Gesamt!F4:F1000)","v":"Mettingen"}]
[null,"3724 PR  00:00:37.805",null,null,"3725 PB  00:00:37.904"]

{"sheet":"Gesamt","index":1,"n_rows":853,"n_cols":20,"rows_kept":853,"cut":false,"hidden":true,"merged":[]}
["10.06.2018 DSKD  Derby Mettingen"]
[null,null,null,null,"Bahn 1","Bahn 2",1,1,1,1,1,1,"Lauf gewertet?\n0 oder 1",1,1,1,1,1,1]
["Nr","Klasse","NRW","Name","Vorname","Verein","H1","H2","H3","H4","H5","H6","Summe","E1","E2","E3","E4","E5","E6","Summe"]
[101,"JUN",null,"Lampe","Ida","Mettingen",38.909999999999997,38.81,38.74,39.049999999999997,null,null,{"$f":"(G4*$G$2 +H4*$H$2+I4*$I$2+J4*$J$2 +K4*$K$2+L4*$L$2)","v":155.51},38.93,38.9,38.79,38.76,null,null,{"$f":"(N4*$N$2 +O4*$O$2+P4*$P$2+Q4*$Q$2 +R4*$R$2+S4*$S$2)","v":155.38}]
[102,"JUN",null,"Paschedag","Mia","Stromberg",38.770000000000003,38.85,38.69,38.96,null,null,{"$f":"(G5*$G$2 +H5*$H$2+I5*$I$2+J5*$J$2 +K5*$K$2+L5*$L$2)","v":155.27000000000001},2,null,null,null,null,null,{"$f":"(N5*$N$2 +O5*$O$2+P5*$P$2+Q5*$Q$2 +R5*$R$2+S5*$S$2)","v":2}]
[103,"JUN",null,"Freudenstein","Romy","Mettingen",38.92,38.96,38.729999999999997,38.94,null,null,155.55000000000001,38.79,38.729999999999997,38.72,38.67,null,null,154.91]
[104,"JUN",null,"Schier","Finn","Stromberg",39.42,39.44,39.69,39.74,null,null,158.29,null,null,null,null,null,null,0]
[105,"JUN",null,"Bednarski","Max","Mettingen",null,null,null,null,null,null,0,null,null,null,null,null,null,0]
[106,"JUN",null,"Plath","Marvin","Mettingen",39.04,39.01,38.950000000000003,39.32,null,null,156.32,39,38.9,38.92,38.92,null,null,155.74]
[107,"JUN",null,"Plath","Johanna","Mettingen",null,null,null,null,null,null,0,null,null,null,null,null,null,0]
[108,"JUN",null,"Pufahl","Maximilian","Mettingen",39.17,39.07,38.99,39.26,null,null,156.49,39.049999999999997,39.11,38.94,39.01,null,null,156.11000000000001]
[109,"JUN",null,"Demleitner","Angelike","Bergkamen",39.29,39.28,39.28,39.49,null,null,157.34,null,null,null,null,null,null,0]
[110,"JUN",null,"Claus","Florentina","Bergkamen",39.200000000000003,39.26,39.450000000000003,39.31,null,null,157.22,null,null,null,null,null,null,0]
[111,"JUN",null,"Meyhoff","Moritz","Mettingen",38.97,38.869999999999997,38.99,38.85,null,null,155.68,38.869999999999997,38.97,38.81,38.72,null,null,155.37]
[112,"JUN",null,"Gahler","Hendrik","Mettingen",null,null,null,null,null,null,0,null,null,null,null,null,null,0]
[113,"JUN",null,"Bednarski","Jonathan","Mettingen",null,null,null,null,null,null,0,null,null,null,null,null,null,0]
[114,"JUN",null,"Reutter","Elisabeth","Stromberg",null,null,null,null,null,null,0,null,null,null,null,null,null,0]
[115,"JUN",null,"Stoffers","Martha","Stromberg",null,null,null,null,null,null,0,null,null,null,null,null,null,0]
[116,"JUN",null,"Hiegemann","Mathilda","Stromberg",null,null,null,null,null,null,0,null,null,null,null,null,null,0]
[117,"JUN",null,"Ording","Louisa","Stromberg",39.47,39.44,39.64,39.479999999999997,null,null,158.03,null,null,null,null,null,null,0]
[118,"JUN",null,"Pflug","Fabian","Stromberg",null,null,null,null,null,null,0,null,null,null,null,null,null,0]
[119,"JUN",null,"Krüger","Michelle","Billerbeck",null,null,null,null,null,null,0,null,null,null,null,null,null,0]
[120,"JUN",null,"Enders","Julius","Billerbeck",null,null,null,null,null,null,0,null,null,null,null,null,null,0]
[121,"JUN",null,"Stoffers","Christina","Stromberg",null,null,null,null,null,null,0,null,null,null,null,null,null,0]
[122,"JUN",null,"Grützner","Lennox","Billerbeck",null,null,null,null,null,null,0,null,null,null,null,null,null,0]
[123,"JUN",null,"Paschedag","Lena","Stromberg",null,null,null,null,null,null,0,null,null,null,null,null,null,0]
[124,"JUN",null,"Crook","Florian","Mettingen",38.96,38.89,38.94,39.11,null,null,155.9,38.85,38.729999999999997,38.909999999999997,38.619999999999997,null,null,155.11000000000001]
[125,"JUN",null,"Meyhoff","Finn","Mettingen",38.83,38.880000000000003,38.99,39.049999999999997,null,null,155.75,38.92,38.9,38.79,38.79,null,null,155.4]
[126,"JUN",null,null,null,null,null,null,null,null,null,null,0,null,null,null,null,null,null,0]
[127,"JUN",null,"Meister","Till","Mettingen",39.6,39.270000000000003,39.79,39.590000000000003,null,null,158.25,39.4,39.14,39.49,39.19,null,null,157.22]
[128,"JUN",null,null,null,null,null,null,null,null,null,null,0,null,null,null,null,null,null,0]
[129,"JUN",null,null,null,null,null,null,null,null,null,null,0,null,null,null,null,null,null,0]
[130,"JUN",null,"Kleinsorge","Henri","Mettingen",44.04,41.76,41.17,40.79,null,null,167.76,40.53,40.46,40.03,39.75,null,null,160.77000000000001]
[131,"JUN",null,null,null,null,null,null,null,null,null,null,0,null,null,null,null,null,null,0]
[132,"JUN",null,null,null,null,null,null,null,null,null,null,0,null,null,null,null,null,null,0]
[133,"JUN",null,null,null,null,null,null,null,null,null,null,0,null,null,null,null,null,null,0]
[134,"JUN",null,null,null,null,null,null,null,null,null,null,0,null,null,null,null,null,null,0]
[135,"JUN",null,null,null,null,null,null,null,null,null,null,0,null,null,null,null,null,null,0]
[136,null,null,null,null,null,null,null,null,null,null,null,0,null,null,null,null,null,null,0]
[137,null,null,null,null,null,null,null,null,null,null,null,0,null,null,null,null,null,null,0]
{"$rows_left_out":814}
{"sheet":"NRW-Junior","index":2,"n_rows":203,"n_cols":16,"rows_kept":203,"cut":false,"hidden":false,"merged":[]}
[{"$f":"Gesamt!A1","v":"10.06.2018 DSKD  Derby Mettingen"}]
["  NRW-Qualifikation JUNIOR - Klasse  "]
[]
["Wird der Lauf gewertet?   dann 0 oder 1 eintragen",null,null,null,null,null,1,1,1,1,1,1]
["Bestzeit je Lauf",null,null,null,null,null,{"$f":"MIN(G9:G203)","v":38.770000000000003},38.81,38.69,38.74,100,0]
[]
["Start\nNummer","Gruppe","startet","Name","Vorname","Verein","Lauf 1","Lauf 2","Lauf 3","Lauf 4","Lauf 5","Lauf 6","Summe der gewerteten Läufe",null,"Platz","Urkunde"]
[]
[102,"JUN",null,"Paschedag","Mia","Stromberg",38.770000000000003,38.85,38.69,38.96,null,null,{"$f":"(G9*$G$4+H9*$H$4+I9*$I$4+J9*$J$4+K9*$K$4+L9*$L$4)","v":155.27000000000001},{"$f":"IF(M9>0,M9*-1,-1000)","v":-155.27000000000001},{"$f":"IF(M9>0,RANK(N9,N:N),0)","v":1}]
[101,"JUN",null,"Lampe","Ida","Mettingen",38.909999999999997,38.81,38.74,39.049999999999997,null,null,155.51,-155.51,2]
[103,"JUN",null,"Freudenstein","Romy","Mettingen",38.92,38.96,38.729999999999997,38.94,null,null,155.55000000000001,-155.55000000000001,3]
[111,"JUN",null,"Meyhoff","Moritz","Mettingen",38.97,38.869999999999997,38.99,38.85,null,null,155.68,-155.68,4]
[105,"JUN",null,"Bednarski","Max","Mettingen",null,null,null,null,null,null,0,-1000,0]
[125,"JUN",null,"Meyhoff","Finn","Mettingen",38.83,38.880000000000003,38.99,39.049999999999997,null,null,155.75,-155.75,5]
[107,"JUN",null,"Plath","Johanna","Mettingen",null,null,null,null,null,null,0,-1000,0]
[124,"JUN",null,"Crook","Florian","Mettingen",38.96,38.89,38.94,39.11,null,null,155.9,-155.9,6]
[106,"JUN",null,"Plath","Marvin","Mettingen",39.04,39.01,38.950000000000003,39.32,null,null,156.32,-156.32,7]
[108,"JUN",null,"Pufahl","Maximilian","Mettingen",39.17,39.07,38.99,39.26,null,null,156.49,-156.49,8]
[110,"JUN",null,"Claus","Florentina","Bergkamen",39.200000000000003,39.26,39.450000000000003,39.31,null,null,157.22,-157.22,9]
[112,"JUN",null,"Gahler","Hendrik","Mettingen",null,null,null,null,null,null,0,-1000,0]
[113,"JUN",null,"Bednarski","Jonathan","Mettingen",null,null,null,null,null,null,0,-1000,0]
[114,"JUN",null,"Reutter","Elisabeth","Stromberg",null,null,null,null,null,null,0,-1000,0]
[115,"JUN",null,"Stoffers","Martha","Stromberg",null,null,null,null,null,null,0,-1000,0]
[116,"JUN",null,"Hiegemann","Mathilda","Stromberg",null,null,null,null,null,null,0,-1000,0]
[109,"JUN",null,"Demleitner","Angelike","Bergkamen",39.29,39.28,39.28,39.49,null,null,157.34,-157.34,10]
[118,"JUN",null,"Pflug","Fabian","Stromberg",null,null,null,null,null,null,0,-1000,0]
[119,"JUN",null,"Krüger","Michelle","Billerbeck",null,null,null,null,null,null,0,-1000,0]
[120,"JUN",null,"Enders","Julius","Billerbeck",null,null,null,null,null,null,0,-1000,0]
[121,"JUN",null,"Stoffers","Christina","Stromberg",null,null,null,null,null,null,0,-1000,0]
[122,"JUN",null,"Grützner","Lennox","Billerbeck",null,null,null,null,null,null,0,-1000,0]
[123,"JUN",null,"Paschedag","Lena","Stromberg",null,null,null,null,null,null,0,-1000,0]
[117,"JUN",null,"Ording","Louisa","Stromberg",39.47,39.44,39.64,39.479999999999997,null,null,158.03,-158.03,11]
[127,"JUN",null,"Meister","Till","Mettingen",39.6,39.270000000000003,39.79,39.590000000000003,null,null,158.25,-158.25,12]
[126,"JUN",null,null,null,null,null,null,null,null,null,null,0,-1000,0]
[104,"JUN",null,"Schier","Finn","Stromberg",39.42,39.44,39.69,39.74,null,null,158.29,-158.29,13]
[128,"JUN",null,null,null,null,null,null,null,null,null,null,0,-1000,0]
[129,"JUN",null,null,null,null,null,null,null,null,null,null,0,-1000,0]
[130,"JUN",null,"Kleinsorge","Henri","Mettingen",44.04,41.76,41.17,40.79,null,null,167.76,-167.76,14]
[131,"JUN",null,null,null,null,null,null,null,null,null,null,0,-1000,0]
[132,"JUN",null,null,null,null,null,null,null,null,null,null,0,-1000,0]
{"$rows_left_out":164}
{"sheet":"NRW-Senior","index":3,"n_rows":203,"n_cols":16,"rows_kept":203,"cut":false,"hidden":false,"merged":[]}
[{"$f":"Gesamt!A1","v":"10.06.2018 DSKD  Derby Mettingen"}]
["  NRW-Qualifikation SENIOR - Klasse  "]
[]
["Wird der Lauf gewertet?   dann 0 oder 1 eintragen",null,null,null,null,null,1,1,1,1,1,1]
["Bestzeit je Lauf",null,null,null,null,null,{"$f":"MIN(G9:G203)","v":37.56},37.58,37.57,37.49,100,0]
[]
["Start\nNummer","Gruppe","startet","Name","Vorname","Verein","Lauf 1","Lauf 2","Lauf 3","Lauf 4","Lauf 5","Lauf 6","Summe der gewerteten Läufe",null,"Platz","Urkunde"]
[]
[319,"SEN",null,"Sonneborn","Ina","Stromberg",37.58,37.58,37.57,37.49,null,null,{"$f":"(G9*$G$4+H9*$H$4+I9*$I$4+J9*$J$4+K9*$K$4+L9*$L$4)","v":150.22},{"$f":"IF(M9>0,M9*-1,-1000)","v":-150.22},{"$f":"IF(M9>0,RANK(N9,N:N),0)","v":1}]
[302,"SEN",null,"Gößling","Jule","Mettingen",null,null,null,null,null,null,0,-1000,0]
[312,"SEN",null,"Neuhaus","Robin","Mettingen",37.56,37.700000000000003,37.67,37.5,null,null,150.43,-150.43,2]
[304,"SEN",null,"Kessling","Sophie","Mettingen",null,null,null,null,null,null,0,-1000,0]
[305,"SEN",null,"Zaruba","Max","Mettingen",37.67,37.67,37.69,37.64,null,null,150.66999999999999,-150.66999999999999,3]
[306,"SEN",null,"Lutterbach","Roman","Simmerath",null,null,null,null,null,null,0,-1000,0]
[307,"SEN",null,"Meyer","Henry","Mettingen",null,null,null,null,null,null,0,-1000,0]
[308,"SEN",null,"Becker","Robin","Bergkamen",null,null,null,null,null,null,0,-1000,0]
[309,"SEN",null,"Lutterbach","Eric","Simmerath",null,null,null,null,null,null,0,-1000,0]
[310,"SEN",null,"Ricker","Sarah","Billerbeck",null,null,null,null,null,null,0,-1000,0]
[311,"SEN",null,"Lammers","Laura","ConAction",null,null,null,null,null,null,0,-1000,0]
[313,"SEN",null,"Meyer","Johann","Mettingen",37.71,37.729999999999997,37.67,37.61,null,null,150.72,-150.72,4]
[301,"SEN",null,"Lampe","Pia","Mettingen",37.74,37.78,37.659999999999997,37.69,null,null,150.87,-150.87,5]
[314,"SEN",null,"Wetter","Stefanie","Billerbeck",null,null,null,null,null,null,0,-1000,0]
[315,"SEN",null,"Steinberg","Kimberly","Billerbeck",null,null,null,null,null,null,0,-1000,0]
[316,"SEN",null,"Wratny","Nikolai","Bergkamen",null,null,null,null,null,null,0,-1000,0]
[317,"SEN",null,"Sternberg","Luise","Billerbeck",null,null,null,null,null,null,0,-1000,0]
[318,"SEN",null,"Szabowski","Mara","Billerbeck",null,null,null,null,null,null,0,-1000,0]
[303,"SEN",null,"Freudenstein","Rieke","Mettingen",37.729999999999997,37.770000000000003,37.78,37.68,null,null,150.96,-150.96,6]
[320,"SEN",null,"Stoffers","Lisa","Stromberg",null,null,null,null,null,null,0,-1000,0]
[321,"SEN",null,null,null,null,null,null,null,null,null,null,0,-1000,0]
[322,"SEN",null,"Grützner","Lennox","Billerbeck",null,null,null,null,null,null,0,-1000,0]
[323,"SEN",null,null,null,null,null,null,null,null,null,null,0,-1000,0]
[324,"SEN",null,null,null,null,null,null,null,null,null,null,0,-1000,0]
[325,"SEN",null,null,null,null,null,null,null,null,null,null,0,-1000,0]
[326,"SEN",null,null,null,null,null,null,null,null,null,null,0,-1000,0]
[327,"SEN",null,null,null,null,null,null,null,null,null,null,0,-1000,0]
[328,"SEN",null,null,null,null,null,null,null,null,null,null,0,-1000,0]
[329,"SEN",null,null,null,null,null,null,null,null,null,null,0,-1000,0]
[330,"SEN",null,null,null,null,null,null,null,null,null,null,0,-1000,0]
[331,"SEN",null,null,null,null,null,null,null,null,null,null,0,-1000,0]
[332,"SEN",null,null,null,null,null,null,null,null,null,null,0,-1000,0]
{"$rows_left_out":164}
{"sheet":"NRW-Elite-XL","index":4,"n_rows":203,"n_cols":17,"rows_kept":203,"cut":false,"hidden":false,"merged":[]}
[{"$f":"Gesamt!A1","v":"10.06.2018 DSKD  Derby Mettingen"}]
["  NRW-Qualifikation Elite XL - Klasse  "]
[]
["Wird der Lauf gewertet?   dann 0 oder 1 eintragen",null,null,null,null,null,1,1,1,1,1,1]
["Bestzeit je Lauf",null,null,null,null,null,{"$f":"MIN(G9:G203)","v":37.71},37.729999999999997,37.57,37.729999999999997,0,0,null,null,null,"Platz","Urkunde"]
[]
["Start\nNummer","Gruppe","startet","Name","Vorname","Verein","Lauf 1","Lauf 2","Lauf 3","Lauf 4","Lauf 5","Lauf 6","Summe der gewerteten Läufe",null,null,{"$f":"IF(M9>0,RANK(N9,N:N),0)","v":0}]
[null,null,null,null,null,null,null,null,null,null,null,null,null,null,null,{"$f":"IF(M10>0,RANK(N10,N:N),0)","v":1}]
[501,"EXL",null,"Ricker","Jana-Lena","Billerbeck",null,null,null,null,null,null,{"$f":"(G9*$G$4+H9*$H$4+I9*$I$4+J9*$J$4+K9*$K$4+L9*$L$4)","v":0},{"$f":"IF(M9>0,M9*-1,-1000)","v":-1000},{"$f":"IF(M9>0,RANK(N9,N:N),0)","v":0}]
[508,"EXL",null,"Meyer","Henry","Mettingen",37.71,37.729999999999997,37.57,37.729999999999997,null,null,{"$f":"(G10*$G$4+H10*$H$4+I10*$I$4+J10*$J$4+K10*$K$4+L10*$L$4)","v":150.74},{"$f":"IF(M10>0,M10*-1,-1000)","v":-150.74},{"$f":"IF(M10>0,RANK(N10,N:N),0)","v":1}]
[503,"EXL",null,"Niessen","Nicolas","Simmerath",null,null,null,null,null,null,0,-1000,0,{"$f":"IF(M13>0,RANK(N13,N:N),0)","v":3}]
[502,"EXL",null,"Schmidt","Marvin","Varel",37.71,37.840000000000003,37.700000000000003,37.799999999999997,null,null,151.05000000000001,-151.05000000000001,2]
[505,"EXL",null,"Marx","Fabian","ConAction",38.14,38.25,38.08,38.19,null,null,152.66,-152.66,3,{"$f":"IF(M15>0,RANK(N15,N:N),0)","v":0}]
[506,"EXL",null,"Elges","Erik","Stromberg",null,null,null,null,null,null,0,-1000,0]
[507,"EXL",null,"Wetter","Sabrina","Billerbeck",null,null,null,null,null,null,0,-1000,0]
[504,"EXL",null,"Schlösser","Timon","Stromberg",38.19,38.270000000000003,38.17,38.19,null,null,152.82,-152.82,4]
[509,"EXL",null,null,null,null,null,null,null,null,null,null,0,-1000,0]
[510,"EXL",null,null,null,null,null,null,null,null,null,null,0,-1000,0]
[511,"EXL",null,null,null,null,null,null,null,null,null,null,0,-1000,0]
[512,"EXL",null,null,null,null,null,null,null,null,null,null,0,-1000,0]
[513,"EXL",null,null,null,null,null,null,null,null,null,null,0,-1000,0]
[514,"EXL",null,null,null,null,null,null,null,null,null,null,0,-1000,0]
[515,"EXL",null,null,null,null,null,null,null,null,null,null,0,-1000,0]
[516,"EXL",null,null,null,null,null,null,null,null,null,null,0,-1000,0]
[517,"EXL",null,null,null,null,null,null,null,null,null,null,0,-1000,0]
[518,"EXL",null,null,null,null,null,null,null,null,null,null,0,-1000,0]
[519,"EXL",null,null,null,null,null,null,null,null,null,null,0,-1000,0]
[520,"EXL",null,null,null,null,null,null,null,null,null,null,0,-1000,0]
[521,"EXL",null,null,null,null,null,null,null,null,null,null,0,-1000,0]
[522,"EXL",null,null,null,null,null,null,null,null,null,null,0,-1000,0]
[523,"EXL",null,null,null,null,null,null,null,null,null,null,0,-1000,0]
[524,"EXL",null,null,null,null,null,null,null,null,null,null,0,-1000,0]
[525,"EXL",null,null,null,null,null,null,null,null,null,null,0,-1000,0]
[526,"EXL",null,null,null,null,null,null,null,null,null,null,0,-1000,0]
[null,null,null,null,null,null,null,null,null,null,null,null,0,-1000,0]
[null,null,null,null,null,null,null,null,null,null,null,null,0,-1000,0]
[null,null,null,null,null,null,null,null,null,null,null,null,0,-1000,0]
[null,null,null,null,null,null,null,null,null,null,null,null,0,-1000,0]
[null,null,null,null,null,null,null,null,null,null,null,null,0,-1000,0]
[null,null,null,null,null,null,null,null,null,null,null,null,0,-1000,0]
{"$rows_left_out":164}
{"sheet":"NRW-Elite-XL-18","index":5,"n_rows":203,"n_cols":16,"rows_kept":203,"cut":false,"hidden":false,"merged":[]}
[{"$f":"Gesamt!A1","v":"10.06.2018 DSKD  Derby Mettingen"}]
["  NRW-Qualifikation Elite XL ü18 - Klasse  "]
[]
["Wird der Lauf gewertet?   dann 0 oder 1 eintragen",null,null,null,null,null,1,1,1,1,1,1]
["Bestzeit je Lauf",null,null,null,null,null,{"$f":"MIN(G9:G203)","v":37.74},37.76,37.72,37.72,0,0]
[]
["Start\nNummer","Gruppe","startet","Name","Vorname","Verein","Lauf 1","Lauf 2","Lauf 3","Lauf 4","Lauf 5","Lauf 6","Summe der gewerteten Läufe",null,"Platz","Urkunde"]
[]
[701,"EXL18",null,"Voß","Marie-Charlotte","Bergkamen",37.770000000000003,37.799999999999997,37.72,37.72,null,null,{"$f":"(G9*$G$4+H9*$H$4+I9*$I$4+J9*$J$4+K9*$K$4+L9*$L$4)","v":151.01},{"$f":"IF(M9>0,M9*-1,-1000)","v":-151.01},{"$f":"IF(M9>0,RANK(N9,N:N),0)","v":1}]
[702,"EXL18",null,"Schmidt","Imke","Varel",null,null,null,null,null,null,0,-1000,0]
[705,"EXL18",null,"Wettendorf","Kathrin","Stromberg",37.74,37.76,37.729999999999997,37.81,null,null,151.04,-151.04,2]
[704,"EXL18",null,"Wetter","Sebastian","Billerbeck",null,null,null,null,null,null,0,-1000,0]
[709,"EXL18",null,"Lange","Florian","Mettingen",37.76,37.99,37.799999999999997,37.82,null,null,151.37,-151.37,3]
[712,"EXL18",null,"Rohls","Sebastian","Stromberg",37.94,37.99,37.82,37.979999999999997,null,null,151.72999999999999,-151.72999999999999,4]
[707,"EXL18",null,"Freudenstein","Thomas","Mettingen",null,null,null,null,null,null,0,-1000,0]
[719,"EXL18",null,"Lammers","Laura","ConAction",37.94,37.89,38.020000000000003,37.93,null,null,151.78,-151.78,5]
[708,"EXL18",null,"Leismann","Dominik","Mettingen",37.94,37.99,37.97,37.950000000000003,null,null,151.85,-151.85,6]
[710,"EXL18",null,"Ricker","Kristina","Billerbeck",null,null,null,null,null,null,0,-1000,0]
[711,"EXL18",null,"Sulitze","Jessica","Bergkamen",null,null,null,null,null,null,0,-1000,0]
[706,"EXL18",null,"Kelch","Maria","Bergkamen",38.090000000000003,38.11,37.81,37.97,null,null,151.97999999999999,-151.97999999999999,7]
[713,"EXL18",null,"Schröer","Sabrina","Mettingen",37.99,38.119999999999997,38.04,38.1,null,null,152.25,-152.25,8]
[714,"EXL18",null,"Roeben","Frank","Simmerath",null,null,null,null,null,null,0,-1000,0]
[715,"EXL18",null,"Leismann","Pascal","Mettingen",null,null,null,null,null,null,0,-1000,0]
[716,"EXL18",null,"Hollunder","Christina","Billerbeck",null,null,null,null,null,null,0,-1000,0]
[717,"EXL18",null,"Isaac","Marvin","Simmerath",null,null,null,null,null,null,0,-1000,0]
[718,"EXL18",null,"Ricker","Claudia","Billerbeck",null,null,null,null,null,null,0,-1000,0]
[703,"EXL18",null,"van Loo","Julian","ConAction",38.130000000000003,38.11,37.97,38.1,null,null,152.31,-152.31,9]
[720,"EXL18",null,"Helms","Markus","Billerbeck",null,null,null,null,null,null,0,-1000,0]
[721,"EXL18",null,null,null,null,null,null,null,null,null,null,0,-1000,0]
[722,"EXL18",null,null,null,null,null,null,null,null,null,null,0,-1000,0]
[723,"EXL18",null,null,null,null,null,null,null,null,null,null,0,-1000,0]
[724,"EXL18",null,null,null,null,null,null,null,null,null,null,0,-1000,0]
[725,"EXL18",null,null,null,null,null,null,null,null,null,null,0,-1000,0]
[725,"EXL18",null,null,null,null,null,null,null,null,null,null,0,-1000,0]
[726,"EXL18",null,null,null,null,null,null,null,null,null,null,0,-1000,0]
[727,"EXL18",null,null,null,null,null,null,null,null,null,null,0,-1000,0]
[728,"EXL18",null,null,null,null,null,null,null,null,null,null,0,-1000,0]
[729,"EXL18",null,null,null,null,null,null,null,null,null,null,0,-1000,0]
[406,"EXL18","Berlin","Schneider","Ingo","Joker Team",38.19,38.26,38.119999999999997,38.26,null,null,152.83000000000001,-152.83000000000001,10]
[405,"EXL18","Berlin","Gutlowski","Svea","Joker Team",38.32,38.47,38.29,38.28,null,null,153.36000000000001,-153.36000000000001,11]
{"$rows_left_out":164}
{"sheet":"NRW-Open","index":7,"n_rows":202,"n_cols":15,"rows_kept":202,"cut":false,"hidden":false,"merged":[]}
[{"$f":"Gesamt!A1","v":"10.06.2018 DSKD  Derby Mettingen"}]
["  NRW-Qualifikation Open - Klasse  "]
[]
["Wird der Lauf gewertet?   dann 0 oder 1 eintragen",null,null,null,null,null,1,1,1,1,1,1,1]
["Bestzeit je Lauf",null,null,null,null,null,{"$f":"MIN(G9:G202)","v":37.58},37.630000000000003,37.68,37.46,0,0,0]
[]
["Start\nNummer","Gruppe","startet","Name","Vorname","Verein","Lauf 1","Lauf 2","Lauf 3","Lauf 4","Lauf 5","Lauf 6","Summe",null,"Platz"]
[]
[901,"Open",null,"Schmidt","Michael","Varel",37.58,37.630000000000003,37.68,37.46,null,null,{"$f":"IF($G$4=1,\nIF(H9>1,(ABS(G9-H9)),0)+\nIF(I9>1,(ABS(G9-I9)),0)+\nIF(J9>1,(ABS(G9-J9)),0)+\nIF(K9>1,(ABS(G9-K9)),0)+\nIF(L9>1,(ABS(G9-L9)),0),\n\nIF(I9>1,(ABS(H9-I9)),0)+\nIF(J9>1,(ABS(H9-J9)),0)+\nIF(K9>1,(ABS(H9-K9)),0) )","v":0.27},{"$f":"IF(M9>0,M9*-1,-1000)","v":-0.27},{"$f":"IF(M9>0,RANK(N9,N:N),0)","v":1}]
[903,"Open",null,"Gerigk-Lorenz","Frank","Overath",38.97,38.89,38.76,38.71,null,null,0.55000000000000004,-0.55000000000000004,2]
[902,"Open",null,"Crook","Florian","Mettingen",null,null,null,null,null,null,0,-1000,0]
[904,"Open",null,"Gaidosch","Udo","Overath",40.090000000000003,40,39.82,39.81,null,null,0.64,-0.64,3]
[919,"Open",null,"Schlösser","Jürgen","Stromberg",43.64,43.99,44.1,43.72,null,null,0.89,-0.89,4]
[905,"Open",null,"Ricker","Andreas","Billerbeck",null,null,null,null,null,null,0,-1000,0]
[906,"Open",null,"Szabowski","Marco","Billerbeck",null,null,null,null,null,null,0,-1000,0]
[907,"Open",null,"Szabowski","Peter","Billerbeck",null,null,null,null,null,null,0,-1000,0]
[908,"Open",null,"Pahlings","Anna","ConAction",null,null,null,null,null,null,0,-1000,0]
[909,"Open",null,"Pahlings","Kai","ConAction",null,null,null,null,null,null,0,-1000,0]
[910,"Open",null,"Drücker","Gavin","Stromberg",null,null,null,null,null,null,0,-1000,0]
[911,"Open",null,"Drücker","Guido","Stromberg",null,null,null,null,null,null,0,-1000,0]
[912,"Open",null,"Wetter","Sabrina","Billerbeck",null,null,null,null,null,null,0,-1000,0]
[913,"Open",null,"Pahlings","Iris","ConAction",null,null,null,null,null,null,0,-1000,0]
[914,"Open",null,"Schulz","Tobias",null,null,null,null,null,null,null,0,-1000,0]
[915,"Open",null,"Enders","Simon","Billerbeck",null,null,null,null,null,null,0,-1000,0]
[916,"Open",null,"Szabowski","Mara","Billerbeck",null,null,null,null,null,null,0,-1000,0]
[917,"Open",null,"Pahlings","Detlev","ConAction",null,null,null,null,null,null,0,-1000,0]
[918,"Open",null,"Thoben","Jonas",null,null,null,null,null,null,null,0,-1000,0]
[407,"Open","Berlin","Schneider","Gabriele","Joker Team",49.78,50.31,49.36,39.81,null,null,10.92,-10.92,5]
[920,"Open",null,"Frede","John",null,null,null,null,null,null,null,0,-1000,0]
[921,"Open",null,"Niessen","Nicolas","Simmerath",null,null,null,null,null,null,0,-1000,0]
[922,"Open",null,"Paradowska","Joana","Mettingen",null,null,null,null,null,null,0,-1000,0]
[923,"Open",null,"Ricker","Oliver","Billerbeck",null,null,null,null,null,null,0,-1000,0]
[924,"Open",null,"Angenendt","Philip","Billerbeck",null,null,null,null,null,null,0,-1000,0]
[925,"Open",null,null,null,null,null,null,null,null,null,null,0,-1000,0]
[926,"Open",null,null,null,null,null,null,null,null,null,null,0,-1000,0]
[927,"Open",null,null,null,null,null,null,null,null,null,null,0,-1000,0]
[928,"Open",null,null,null,null,null,null,null,null,null,null,0,-1000,0]
[null,null,null,null,null,null,null,null,null,null,null,null,0,-1000,0]
[null,null,null,null,null,null,null,null,null,null,null,null,0,-1000,0]
[null,null,null,null,null,null,null,null,null,null,null,null,0,-1000,0]
{"$rows_left_out":162}