{"text_format":"1","workbook":"xlsx","n_sheets":9,"sheets":["Eingabe","Gesamt","Ergebnis","Prog","ErgebnisEndlauf","Protokoll","Überschriften","Versionen","Hinweise"],"not_rendered":{"charts":0,"images":0,"macros":1,"external_links":0,"defined_names":4,"comments":1,"pivot_tables":0},"unopened":[{"sheet":"Prog","index":3,"reason":"part_missing"}],"bounds":{"document_bytes":16777216,"sheet_cells":100000,"rows_first":2000,"rows_last":500,"rows_between":2000,"halvings":0,"cell_chars":16384,"cell_head_chars":4096},"cells_cut":0,"cells_raw":0,"read":"whole","date_system":"1900"}

{"sheet":"Eingabe","index":0,"n_rows":22,"n_cols":12,"rows_kept":22,"cut":false,"hidden":false,"merged":[[1,1,1,5],[18,1,18,2],[19,1,19,2],[20,1,20,2],[18,4,18,5],[19,4,19,5],[20,4,20,5],[20,7,21,7],[20,8,21,8],[19,7,19,8],[21,1,21,3],[21,4,21,5]]}
[]
[null,"Zeitmessung Seifenkisten Derby Mettingen"]
[]
[]
[null,"V9.6"]
[null,null,"Bahn 1 PR",null,"Bahn 2 PB"]
[]
[null,"Lauf ",6,null,6]
[]
[null,"Start-Nr",702,517,999,null,null,null,null,null,null,"      "]
[null,null,null,null,null,null,null,null,null,null,null,"      "]
[null,"Zeit",42.3,null,38.97]
[null,null,null,null,null,null,null,null,null,null,null,"      "]
[null,null,"Hauptlauf / Endlauf  ?",null,"Hauptlauf",null,null,null,null,null,null,"      "]
[null,"Hauptlauf-Daten übertragen und gespeichert",null,null,null,null,null,null,null,null,null,"      "]
{"$rows_left_out":8}
{"sheet":"Gesamt","index":1,"n_rows":902,"n_cols":20,"rows_kept":902,"cut":false,"hidden":false,"merged":[[0,6,0,11],[0,13,0,18]]}
[null,null,null,null,null,null,"Hauptlauf",null,null,null,null,null,null,"Endlauf"]
[null,null,null,null,"Bahn 1","Bahn 2",1,1,1,1,1,1,"Lauf gewertet ?\n0 oder 1",1,1,1,1,1,1]
["Star\nNr","Renn\nKlasse","NRW\nWertung","Name","Vorname","Verein","1.\nLauf","2.\nLauf","3.\nLauf","4.\nLauf","5.\nLauf","6.\nLauf","Summe","1.\nEndlauf","2.\nEndlauf","3.\nEndlauf","4.\nEndlauf","5.\nEndlauf","6.\nEndlauf","Summe"]
[101,"JUN",null,"Thiemann","Jela","Stromberg",37.979999999999997,38.47,38.340000000000003,38.700000000000003,38.26,38.5,{"$f":"(G4*$G$2 +H4*$H$2+I4*$I$2+J4*$J$2 +K4*$K$2+L4*$L$2)","v":230.25},null,null,null,null,null,null,{"$f":"(N4*$N$2 +O4*$O$2+P4*$P$2+Q4*$Q$2 +R4*$R$2+S4*$S$2)","v":0}]
[102,"JUN",null,"Obermeyer","Theo","Mettingen",38.380000000000003,38.83,38.67,39.06,38.770000000000003,38.65,{"$f":"(G5*$G$2 +H5*$H$2+I5*$I$2+J5*$J$2 +K5*$K$2+L5*$L$2)","v":232.36},null,null,null,null,null,null,{"$f":"(N5*$N$2 +O5*$O$2+P5*$P$2+Q5*$Q$2 +R5*$R$2+S5*$S$2)","v":0}]
[103,"JUN",null,"Farwig","Alexander","Mettingen",38.32,38.61,39.03,39.04,38.92,39.06,232.98,null,null,null,null,null,null,0]
[104,"JUN",null,"Rickard","Julia","Billerbeck",38.590000000000003,38.86,39.15,39.15,39.020000000000003,38.93,233.7,null,null,null,null,null,null,0]
[105,"JUN",null,"Averkamp","Milan","Billerbeck",38.5,39.11,39.17,39.39,38.86,38.97,234,null,null,null,null,null,null,0]
[106,"JUN",null,"Lange","Peter","Mettingen",null,null,null,null,null,null,0,null,null,null,null,null,null,0]
[107,"JUN",null,"Teeken","Jorik","Mettingen",null,null,null,null,null,null,0,null,null,null,null,null,null,0]
[108,"JUN",null,"Bednarski","Frederik","Mettingen",null,null,null,null,null,null,0,null,null,null,null,null,null,0]
[109,"JUN",null,"Lüttmann","Merle","Mettingen",null,null,null,null,null,null,0,null,null,null,null,null,null,0]
[110,"JUN",null,"Bauer","Bella","Stromberg",null,null,null,null,null,null,0,null,null,null,null,null,null,0]
[111,"JUN",null,"Lange","Helene","Mettingen",null,null,null,null,null,null,0,null,null,null,null,null,null,0]
[112,"JUN",null,"Teeken","Lasse","Mettingen",null,null,null,null,null,null,0,null,null,null,null,null,null,0]
{"$rows_left_out":888}
{"sheet":"Ergebnis","index":2,"n_rows":107,"n_cols":16,"rows_kept":107,"cut":false,"hidden":false,"merged":[[2,0,2,11],[4,6,4,11],[3,12,5,14],[0,1,0,12],[1,1,1,12]]}
[null,"09.06.2024    Derby in Mettingen"]
[null,"NRW-Qualifikation Open - Klasse"]
[]
[null,null,null,null,null,null,{"$f":"Gesamt!G2","v":1},{"$f":"Gesamt!H2","v":1},{"$f":"Gesamt!I2","v":1},{"$f":"Gesamt!J2","v":1},{"$f":"Gesamt!K2","v":1},{"$f":"Gesamt!L2","v":1},"Blatt ist\nschreibgeschützt"]
[null,null,null,null,null,null,"Wird der Lauf gewertet?   dann 0 oder 1 "]
[]
["Start\nNummer","Gruppe","NRW","Name","Vorname","Verein","Lauf 1","Lauf 2","Lauf 3","Lauf 4","Lauf 5","Lauf 6","Summe der gewerteten Läufe",null,"Platz","Urkunde"]
[]
[701,{"$f":"LOOKUP(A9,Gesamt!A$4:A$1000,Gesamt!B$4:B$1000)","v":"Open"},{"$f":"LOOKUP(A9,Gesamt!A$4:A$1000,Gesamt!C$4:C$1000)","v":0},{"$f":"LOOKUP(A9,Gesamt!A$4:A$1000,Gesamt!D$4:D$1000)","v":0},{"$f":"LOOKUP(A9,Gesamt!A$4:A$1000,Gesamt!E$4:E$1000)","v":0},{"$f":"LOOKUP(A9,Gesamt!A$4:A$1000,Gesamt!F$4:F$1000)","v":0},{"$f":"LOOKUP(A9,Gesamt!A$4:A$1000,Gesamt!G$4:G$1000)","v":0},{"$f":"LOOKUP(A9,Gesamt!A$4:A$1000,Gesamt!H$4:H$1000)","v":0},{"$f":"LOOKUP(A9,Gesamt!A$4:A$1000,Gesamt!I$4:I$1000)","v":0},{"$f":"LOOKUP(A9,Gesamt!A$4:A$1000,Gesamt!J$4:J$1000)","v":0},{"$f":"LOOKUP(A9,Gesamt!A$4:A$1000,Gesamt!K$4:K$1000)","v":0},{"$f":"LOOKUP(A9,Gesamt!A$4:A$1000,Gesamt!L$4:L$1000)","v":0},{"$f":"LOOKUP(A9,Gesamt!A$4:A$1000,Gesamt!M$4:M$1000)","v":0},{"$f":"IF(M9>0,M9*-1,-1000)","v":-1000},{"$f":"IF(M9>0,RANK(N9,N:N),0)","v":0}]
[702,{"$f":"LOOKUP(A10,Gesamt!A$4:A$1000,Gesamt!B$4:B$1000)","v":"Open"},{"$f":"LOOKUP(A10,Gesamt!A$4:A$1000,Gesamt!C$4:C$1000)","v":0},{"$f":"LOOKUP(A10,Gesamt!A$4:A$1000,Gesamt!D$4:D$1000)","v":"Neuhaus"},{"$f":"LOOKUP(A10,Gesamt!A$4:A$1000,Gesamt!E$4:E$1000)","v":"Robin"},{"$f":"LOOKUP(A10,Gesamt!A$4:A$1000,Gesamt!F$4:F$1000)","v":"Mettingen"},{"$f":"LOOKUP(A10,Gesamt!A$4:A$1000,Gesamt!G$4:G$1000)","v":40.700000000000003},{"$f":"LOOKUP(A10,Gesamt!A$4:A$1000,Gesamt!H$4:H$1000)","v":41.24},{"$f":"LOOKUP(A10,Gesamt!A$4:A$1000,Gesamt!I$4:I$1000)","v":40.96},{"$f":"LOOKUP(A10,Gesamt!A$4:A$1000,Gesamt!J$4:J$1000)","v":42},{"$f":"LOOKUP(A10,Gesamt!A$4:A$1000,Gesamt!K$4:K$1000)","v":41.13},{"$f":"LOOKUP(A10,Gesamt!A$4:A$1000,Gesamt!L$4:L$1000)","v":42.3},{"$f":"LOOKUP(A10,Gesamt!A$4:A$1000,Gesamt!M$4:M$1000)","v":4.13},{"$f":"IF(M10>0,M10*-1,-1000)","v":-4.13},{"$f":"IF(M10>0,RANK(N10,N:N),0)","v":1}]
[703,{"$f":"LOOKUP(A11,Gesamt!A$4:A$1000,Gesamt!B$4:B$1000)","v":"Open"},{"$f":"LOOKUP(A11,Gesamt!A$4:A$1000,Gesamt!C$4:C$1000)","v":0},{"$f":"LOOKUP(A11,Gesamt!A$4:A$1000,Gesamt!D$4:D$1000)","v":0},{"$f":"LOOKUP(A11,Gesamt!A$4:A$1000,Gesamt!E$4:E$1000)","v":0},{"$f":"LOOKUP(A11,Gesamt!A$4:A$1000,Gesamt!F$4:F$1000)","v":0},{"$f":"LOOKUP(A11,Gesamt!A$4:A$1000,Gesamt!G$4:G$1000)","v":0},{"$f":"LOOKUP(A11,Gesamt!A$4:A$1000,Gesamt!H$4:H$1000)","v":0},{"$f":"LOOKUP(A11,Gesamt!A$4:A$1000,Gesamt!I$4:I$1000)","v":0},{"$f":"LOOKUP(A11,Gesamt!A$4:A$1000,Gesamt!J$4:J$1000)","v":0},{"$f":"LOOKUP(A11,Gesamt!A$4:A$1000,Gesamt!K$4:K$1000)","v":0},{"$f":"LOOKUP(A11,Gesamt!A$4:A$1000,Gesamt!L$4:L$1000)","v":0},{"$f":"LOOKUP(A11,Gesamt!A$4:A$1000,Gesamt!M$4:M$1000)","v":0},{"$f":"IF(M11>0,M11*-1,-1000)","v":-1000},{"$f":"IF(M11>0,RANK(N11,N:N),0)","v":0}]
[704,{"$f":"LOOKUP(A12,Gesamt!A$4:A$1000,Gesamt!B$4:B$1000)","v":"Open"},{"$f":"LOOKUP(A12,Gesamt!A$4:A$1000,Gesamt!C$4:C$1000)","v":0},{"$f":"LOOKUP(A12,Gesamt!A$4:A$1000,Gesamt!D$4:D$1000)","v":0},{"$f":"LOOKUP(A12,Gesamt!A$4:A$1000,Gesamt!E$4:E$1000)","v":0},{"$f":"LOOKUP(A12,Gesamt!A$4:A$1000,Gesamt!F$4:F$1000)","v":0},{"$f":"LOOKUP(A12,Gesamt!A$4:A$1000,Gesamt!G$4:G$1000)","v":0},{"$f":"LOOKUP(A12,Gesamt!A$4:A$1000,Gesamt!H$4:H$1000)","v":0},{"$f":"LOOKUP(A12,Gesamt!A$4:A$1000,Gesamt!I$4:I$1000)","v":0},{"$f":"LOOKUP(A12,Gesamt!A$4:A$1000,Gesamt!J$4:J$1000)","v":0},{"$f":"LOOKUP(A12,Gesamt!A$4:A$1000,Gesamt!K$4:K$1000)","v":0},{"$f":"LOOKUP(A12,Gesamt!A$4:A$1000,Gesamt!L$4:L$1000)","v":0},{"$f":"LOOKUP(A12,Gesamt!A$4:A$1000,Gesamt!M$4:M$1000)","v":0},{"$f":"IF(M12>0,M12*-1,-1000)","v":-1000},{"$f":"IF(M12>0,RANK(N12,N:N),0)","v":0}]
[705,{"$f":"LOOKUP(A13,Gesamt!A$4:A$1000,Gesamt!B$4:B$1000)","v":"Open"},{"$f":"LOOKUP(A13,Gesamt!A$4:A$1000,Gesamt!C$4:C$1000)","v":0},{"$f":"LOOKUP(A13,Gesamt!A$4:A$1000,Gesamt!D$4:D$1000)","v":0},{"$f":"LOOKUP(A13,Gesamt!A$4:A$1000,Gesamt!E$4:E$1000)","v":0},{"$f":"LOOKUP(A13,Gesamt!A$4:A$1000,Gesamt!F$4:F$1000)","v":0},{"$f":"LOOKUP(A13,Gesamt!A$4:A$1000,Gesamt!G$4:G$1000)","v":0},{"$f":"LOOKUP(A13,Gesamt!A$4:A$1000,Gesamt!H$4:H$1000)","v":0},{"$f":"LOOKUP(A13,Gesamt!A$4:A$1000,Gesamt!I$4:I$1000)","v":0},{"$f":"LOOKUP(A13,Gesamt!A$4:A$1000,Gesamt!J$4:J$1000)","v":0},{"$f":"LOOKUP(A13,Gesamt!A$4:A$1000,Gesamt!K$4:K$1000)","v":0},{"$f":"LOOKUP(A13,Gesamt!A$4:A$1000,Gesamt!L$4:L$1000)","v":0},{"$f":"LOOKUP(A13,Gesamt!A$4:A$1000,Gesamt!M$4:M$1000)","v":0},{"$f":"IF(M13>0,M13*-1,-1000)","v":-1000},{"$f":"IF(M13>0,RANK(N13,N:N),0)","v":0}]
[706,{"$f":"LOOKUP(A14,Gesamt!A$4:A$1000,Gesamt!B$4:B$1000)","v":"Open"},{"$f":"LOOKUP(A14,Gesamt!A$4:A$1000,Gesamt!C$4:C$1000)","v":0},{"$f":"LOOKUP(A14,Gesamt!A$4:A$1000,Gesamt!D$4:D$1000)","v":0},{"$f":"LOOKUP(A14,Gesamt!A$4:A$1000,Gesamt!E$4:E$1000)","v":0},{"$f":"LOOKUP(A14,Gesamt!A$4:A$1000,Gesamt!F$4:F$1000)","v":0},{"$f":"LOOKUP(A14,Gesamt!A$4:A$1000,Gesamt!G$4:G$1000)","v":0},{"$f":"LOOKUP(A14,Gesamt!A$4:A$1000,Gesamt!H$4:H$1000)","v":0},{"$f":"LOOKUP(A14,Gesamt!A$4:A$1000,Gesamt!I$4:I$1000)","v":0},{"$f":"LOOKUP(A14,Gesamt!A$4:A$1000,Gesamt!J$4:J$1000)","v":0},{"$f":"LOOKUP(A14,Gesamt!A$4:A$1000,Gesamt!K$4:K$1000)","v":0},{"$f":"LOOKUP(A14,Gesamt!A$4:A$1000,Gesamt!L$4:L$1000)","v":0},{"$f":"LOOKUP(A14,Gesamt!A$4:A$1000,Gesamt!M$4:M$1000)","v":0},{"$f":"IF(M14>0,M14*-1,-1000)","v":-1000},{"$f":"IF(M14>0,RANK(N14,N:N),0)","v":0}]
[707,{"$f":"LOOKUP(A15,Gesamt!A$4:A$1000,Gesamt!B$4:B$1000)","v":"Open"},{"$f":"LOOKUP(A15,Gesamt!A$4:A$1000,Gesamt!C$4:C$1000)","v":0},{"$f":"LOOKUP(A15,Gesamt!A$4:A$1000,Gesamt!D$4:D$1000)","v":0},{"$f":"LOOKUP(A15,Gesamt!A$4:A$1000,Gesamt!E$4:E$1000)","v":0},{"$f":"LOOKUP(A15,Gesamt!A$4:A$1000,Gesamt!F$4:F$1000)","v":0},{"$f":"LOOKUP(A15,Gesamt!A$4:A$1000,Gesamt!G$4:G$1000)","v":0},{"$f":"LOOKUP(A15,Gesamt!A$4:A$1000,Gesamt!H$4:H$1000)","v":0},{"$f":"LOOKUP(A15,Gesamt!A$4:A$1000,Gesamt!I$4:I$1000)","v":0},{"$f":"LOOKUP(A15,Gesamt!A$4:A$1000,Gesamt!J$4:J$1000)","v":0},{"$f":"LOOKUP(A15,Gesamt!A$4:A$1000,Gesamt!K$4:K$1000)","v":0},{"$f":"LOOKUP(A15,Gesamt!A$4:A$1000,Gesamt!L$4:L$1000)","v":0},{"$f":"LOOKUP(A15,Gesamt!A$4:A$1000,Gesamt!M$4:M$1000)","v":0},{"$f":"IF(M15>0,M15*-1,-1000)","v":-1000},{"$f":"IF(M15>0,RANK(N15,N:N),0)","v":0}]
{"$rows_left_out":93}
{"sheet":"ErgebnisEndlauf","index":4,"n_rows":107,"n_cols":16,"rows_kept":107,"cut":false,"hidden":false,"merged":[[2,0,2,11],[3,12,5,14],[4,6,4,11]]}
["21.08.2022   DSKD Derby Seppenrade"]
["Endlauf JUNIOR - Klasse"]
[]
[null,null,null,null,null,null,{"$f":"Gesamt!G2","v":1},{"$f":"Gesamt!H2","v":1},{"$f":"Gesamt!I2","v":1},{"$f":"Gesamt!J2","v":1},{"$f":"Gesamt!K2","v":1},{"$f":"Gesamt!L2","v":1},"Blatt ist\nschreibgeschützt"]
[null,null,null,null,null,null,"Wird der Lauf gewertet?   dann 0 oder 1 "]
[]
["Start\nNummer","Gruppe","NRW","Name","Vorname","Verein","Lauf 1","Lauf 2","Lauf 3","Lauf 4","Lauf 5","Lauf 6","Summe der gewerteten Läufe",null,"Platz","Urkunde"]
[]
[101,{"$f":"LOOKUP(A9,Gesamt!A$4:A$1000,Gesamt!B$4:B$1000)","v":"JUN"},{"$f":"LOOKUP(A9,Gesamt!A$4:A$1000,Gesamt!C$4:C$1000)","v":0},{"$f":"LOOKUP(A9,Gesamt!A$4:A$1000,Gesamt!D$4:D$1000)","v":"Thiemann"},{"$f":"LOOKUP(A9,Gesamt!A$4:A$1000,Gesamt!E$4:E$1000)","v":"Jela"},{"$f":"LOOKUP(A9,Gesamt!A$4:A$1000,Gesamt!F$4:F$1000)","v":"Stromberg"},{"$f":"LOOKUP(A9,Gesamt!A$4:A$1000,Gesamt!N$4:N$1000)","v":0},{"$f":"LOOKUP(A9,Gesamt!A$4:A$1000,Gesamt!O$4:O$1000)","v":0},{"$f":"LOOKUP(A9,Gesamt!A$4:A$1000,Gesamt!P$4:P$1000)","v":0},{"$f":"LOOKUP(A9,Gesamt!A$4:A$1000,Gesamt!Q$4:Q$1000)","v":0},{"$f":"LOOKUP(A9,Gesamt!A$4:A$1000,Gesamt!R$4:R$1000)","v":0},{"$f":"LOOKUP(A9,Gesamt!A$4:A$1000,Gesamt!S$4:S$1000)","v":0},{"$f":"LOOKUP(A9,Gesamt!A$4:A$1000,Gesamt!T$4:T$1000)","v":0},{"$f":"IF(M9>0,M9*-1,-1000)","v":-1000},{"$f":"IF(M9>0,RANK(N9,N:N),0)","v":0}]
[102,{"$f":"LOOKUP(A10,Gesamt!A$4:A$1000,Gesamt!B$4:B$1000)","v":"JUN"},{"$f":"LOOKUP(A10,Gesamt!A$4:A$1000,Gesamt!C$4:C$1000)","v":0},{"$f":"LOOKUP(A10,Gesamt!A$4:A$1000,Gesamt!D$4:D$1000)","v":"Obermeyer"},{"$f":"LOOKUP(A10,Gesamt!A$4:A$1000,Gesamt!E$4:E$1000)","v":"Theo"},{"$f":"LOOKUP(A10,Gesamt!A$4:A$1000,Gesamt!F$4:F$1000)","v":"Mettingen"},{"$f":"LOOKUP(A10,Gesamt!A$4:A$1000,Gesamt!N$4:N$1000)","v":0},{"$f":"LOOKUP(A10,Gesamt!A$4:A$1000,Gesamt!O$4:O$1000)","v":0},{"$f":"LOOKUP(A10,Gesamt!A$4:A$1000,Gesamt!P$4:P$1000)","v":0},{"$f":"LOOKUP(A10,Gesamt!A$4:A$1000,Gesamt!Q$4:Q$1000)","v":0},{"$f":"LOOKUP(A10,Gesamt!A$4:A$1000,Gesamt!R$4:R$1000)","v":0},{"$f":"LOOKUP(A10,Gesamt!A$4:A$1000,Gesamt!S$4:S$1000)","v":0},{"$f":"LOOKUP(A10,Gesamt!A$4:A$1000,Gesamt!T$4:T$1000)","v":0},-1000,0]
[103,{"$f":"LOOKUP(A11,Gesamt!A$4:A$1000,Gesamt!B$4:B$1000)","v":"JUN"},{"$f":"LOOKUP(A11,Gesamt!A$4:A$1000,Gesamt!C$4:C$1000)","v":0},{"$f":"LOOKUP(A11,Gesamt!A$4:A$1000,Gesamt!D$4:D$1000)","v":"Farwig"},{"$f":"LOOKUP(A11,Gesamt!A$4:A$1000,Gesamt!E$4:E$1000)","v":"Alexander"},{"$f":"LOOKUP(A11,Gesamt!A$4:A$1000,Gesamt!F$4:F$1000)","v":"Mettingen"},{"$f":"LOOKUP(A11,Gesamt!A$4:A$1000,Gesamt!N$4:N$1000)","v":0},{"$f":"LOOKUP(A11,Gesamt!A$4:A$1000,Gesamt!O$4:O$1000)","v":0},{"$f":"LOOKUP(A11,Gesamt!A$4:A$1000,Gesamt!P$4:P$1000)","v":0},{"$f":"LOOKUP(A11,Gesamt!A$4:A$1000,Gesamt!Q$4:Q$1000)","v":0},{"$f":"LOOKUP(A11,Gesamt!A$4:A$1000,Gesamt!R$4:R$1000)","v":0},{"$f":"LOOKUP(A11,Gesamt!A$4:A$1000,Gesamt!S$4:S$1000)","v":0},{"$f":"LOOKUP(A11,Gesamt!A$4:A$1000,Gesamt!T$4:T$1000)","v":0},-1000,0]
[104,{"$f":"LOOKUP(A12,Gesamt!A$4:A$1000,Gesamt!B$4:B$1000)","v":"JUN"},{"$f":"LOOKUP(A12,Gesamt!A$4:A$1000,Gesamt!C$4:C$1000)","v":0},{"$f":"LOOKUP(A12,Gesamt!A$4:A$1000,Gesamt!D$4:D$1000)","v":"Rickard"},{"$f":"LOOKUP(A12,Gesamt!A$4:A$1000,Gesamt!E$4:E$1000)","v":"Julia"},{"$f":"LOOKUP(A12,Gesamt!A$4:A$1000,Gesamt!F$4:F$1000)","v":"Billerbeck"},{"$f":"LOOKUP(A12,Gesamt!A$4:A$1000,Gesamt!N$4:N$1000)","v":0},{"$f":"LOOKUP(A12,Gesamt!A$4:A$1000,Gesamt!O$4:O$1000)","v":0},{"$f":"LOOKUP(A12,Gesamt!A$4:A$1000,Gesamt!P$4:P$1000)","v":0},{"$f":"LOOKUP(A12,Gesamt!A$4:A$1000,Gesamt!Q$4:Q$1000)","v":0},{"$f":"LOOKUP(A12,Gesamt!A$4:A$1000,Gesamt!R$4:R$1000)","v":0},{"$f":"LOOKUP(A12,Gesamt!A$4:A$1000,Gesamt!S$4:S$1000)","v":0},{"$f":"LOOKUP(A12,Gesamt!A$4:A$1000,Gesamt!T$4:T$1000)","v":0},-1000,0]
[105,{"$f":"LOOKUP(A13,Gesamt!A$4:A$1000,Gesamt!B$4:B$1000)","v":"JUN"},{"$f":"LOOKUP(A13,Gesamt!A$4:A$1000,Gesamt!C$4:C$1000)","v":0},{"$f":"LOOKUP(A13,Gesamt!A$4:A$1000,Gesamt!D$4:D$1000)","v":"Averkamp"},{"$f":"LOOKUP(A13,Gesamt!A$4:A$1000,Gesamt!E$4:E$1000)","v":"Milan"},{"$f":"LOOKUP(A13,Gesamt!A$4:A$1000,Gesamt!F$4:F$1000)","v":"Billerbeck"},{"$f":"LOOKUP(A13,Gesamt!A$4:A$1000,Gesamt!N$4:N$1000)","v":0},{"$f":"LOOKUP(A13,Gesamt!A$4:A$1000,Gesamt!O$4:O$1000)","v":0},{"$f":"LOOKUP(A13,Gesamt!A$4:A$1000,Gesamt!P$4:P$1000)","v":0},{"$f":"LOOKUP(A13,Gesamt!A$4:A$1000,Gesamt!Q$4:Q$1000)","v":0},{"$f":"LOOKUP(A13,Gesamt!A$4:A$1000,Gesamt!R$4:R$1000)","v":0},{"$f":"LOOKUP(A13,Gesamt!A$4:A$1000,Gesamt!S$4:S$1000)","v":0},{"$f":"LOOKUP(A13,Gesamt!A$4:A$1000,Gesamt!T$4:T$1000)","v":0},-1000,0]
[106,{"$f":"LOOKUP(A14,Gesamt!A$4:A$1000,Gesamt!B$4:B$1000)","v":"JUN"},{"$f":"LOOKUP(A14,Gesamt!A$4:A$1000,Gesamt!C$4:C$1000)","v":0},{"$f":"LOOKUP(A14,Gesamt!A$4:A$1000,Gesamt!D$4:D$1000)","v":"Lange"},{"$f":"LOOKUP(A14,Gesamt!A$4:A$1000,Gesamt!E$4:E$1000)","v":"Peter"},{"$f":"LOOKUP(A14,Gesamt!A$4:A$1000,Gesamt!F$4:F$1000)","v":"Mettingen"},{"$f":"LOOKUP(A14,Gesamt!A$4:A$1000,Gesamt!N$4:N$1000)","v":0},{"$f":"LOOKUP(A14,Gesamt!A$4:A$1000,Gesamt!O$4:O$1000)","v":0},{"$f":"LOOKUP(A14,Gesamt!A$4:A$1000,Gesamt!P$4:P$1000)","v":0},{"$f":"LOOKUP(A14,Gesamt!A$4:A$1000,Gesamt!Q$4:Q$1000)","v":0},{"$f":"LOOKUP(A14,Gesamt!A$4:A$1000,Gesamt!R$4:R$1000)","v":0},{"$f":"LOOKUP(A14,Gesamt!A$4:A$1000,Gesamt!S$4:S$1000)","v":0},{"$f":"LOOKUP(A14,Gesamt!A$4:A$1000,Gesamt!T$4:T$1000)","v":0},-1000,0]
[107,{"$f":"LOOKUP(A15,Gesamt!A$4:A$1000,Gesamt!B$4:B$1000)","v":"JUN"},{"$f":"LOOKUP(A15,Gesamt!A$4:A$1000,Gesamt!C$4:C$1000)","v":0},{"$f":"LOOKUP(A15,Gesamt!A$4:A$1000,Gesamt!D$4:D$1000)","v":"Teeken"},{"$f":"LOOKUP(A15,Gesamt!A$4:A$1000,Gesamt!E$4:E$1000)","v":"Jorik"},{"$f":"LOOKUP(A15,Gesamt!A$4:A$1000,Gesamt!F$4:F$1000)","v":"Mettingen"},{"$f":"LOOKUP(A15,Gesamt!A$4:A$1000,Gesamt!N$4:N$1000)","v":0},{"$f":"LOOKUP(A15,Gesamt!A$4:A$1000,Gesamt!O$4:O$1000)","v":0},{"$f":"LOOKUP(A15,Gesamt!A$4:A$1000,Gesamt!P$4:P$1000)","v":0},{"$f":"LOOKUP(A15,Gesamt!A$4:A$1000,Gesamt!Q$4:Q$1000)","v":0},{"$f":"LOOKUP(A15,Gesamt!A$4:A$1000,Gesamt!R$4:R$1000)","v":0},{"$f":"LOOKUP(A15,Gesamt!A$4:A$1000,Gesamt!S$4:S$1000)","v":0},{"$f":"LOOKUP(A15,Gesamt!A$4:A$1000,Gesamt!T$4:T$1000)","v":0},-1000,0]
{"$rows_left_out":93}
{"sheet":"Protokoll","index":5,"n_rows":39,"n_cols":11,"rows_kept":39,"cut":false,"hidden":false,"merged":[]}
[]
["Lauf\nNr",null,null,"Start\nUhrzeit",null,null,"Lauf\nNr",null,null,"Start\nUhrzeit"]
["Bahn 1",null,null,"Bahn 2",null,null,"Bahn 1",null,null,"Bahn 2"]
["Start\nNummer","Zeit",null,"Start\nNummer","Zeit",null,"Start\nNummer","Zeit",null,"Start\nNummer","Zeit"]
[null,null,null,null,null,1]
[null,null,null,null,null,2]
[null,null,null,null,null,3]
[null,null,null,null,null,4]
[null,null,null,null,null,5]
[null,null,null,null,null,6]
[null,null,null,null,null,7]
[null,null,null,null,null,8]
[null,null,null,null,null,9]
[null,null,null,null,null,10]
[null,null,null,null,null,11]
{"$rows_left_out":25}
{"sheet":"Überschriften","index":6,"n_rows":12,"n_cols":4,"rows_kept":12,"cut":false,"hidden":false,"merged":[[0,1,0,3],[1,2,1,3]]}
[null,"Hier werden die Überschriften der automatischen Ergebnis-Listen definiert"]
[null,null,"09.06.2024    Derby in Mettingen"]
[null," ","für das Registerblatt \"Ergebnis\"","für das Registerblatt \"ErgebnisEndlauf\""]
[null,"Liste 100","NRW-Qualifikation JUNIOR - Klasse","Endlauf JUNIOR - Klasse"]
[null,"Liste 200","TüöttenCup","Endlauf Liste 200"]
[null,"Liste 300","NRW-Qualifikation SENIOR - Klasse","Endlauf SENIOR - Klasse"]
[null,"Liste 400","Liste 400","Endlauf Liste 400"]
[null,"Liste 500","NRW-Qualifikation Elite XL - Klasse","Endlauf Elite XL - Klasse"]
[null,"Liste 600","Liste 600","Endlauf Liste 600"]
[null,"Liste 700","NRW-Qualifikation Open - Klasse","Endlauf Elite XL ü18 - Klasse"]
[null,"Liste 800","Ortsderby Abc","Endlauf Liste 800"]
[null,"Liste 900",null,"Endlauf  Open - Klasse"]

{"sheet":"Versionen","index":7,"n_rows":7,"n_cols":2,"rows_kept":7,"cut":false,"hidden":false,"merged":[]}
[null,"Franz Tenambergen \nSeifenkisten Mettingen\n\nfranz.tenambergen@t-online.de\n0160 472 89 33\n\nbei Problemen oder Fragen gerne melden"]
["V9.1","3 Täler Rennen Mettingen\nneu nur 1 ErgebnissBlatt für alle Klassen\nErgebnisse werden über den AuswahlButton aus der Gesamtliste abgerufen"]
["V9.2","Sicherheitsüberprüfung ob bereits Zeiten für diesen Lauf eingetragen sind\nggf. würden Daten überschrieben"]
["V9.3","Vorbereitung auf Rennen in Seppenrade\nListe der 800 ist Ortsderby in Gleichmäßigkeitswertung"]
["V9.4","Vorbereitung auf Rennen in Mettingen 02.-04.06.2023\n"]
["V9.5","Vorbereitung auf Siegerurkunden\nBeiden Überschriften im Blatt \"Ergebnis\" a1 nach b1 verschoben"]
["V9.6","Vorbereitung auf Ortsderby Mettingen 2024"]

{"sheet":"Hinweise","index":8,"n_rows":26,"n_cols":2,"rows_kept":26,"cut":false,"hidden":false,"merged":[]}
[]
[null,"Hinweise zur Benutzung dieser Tabellen mit einem ALGE-Timer"]
[]
[]
[null,"Inbetriebnahme des ALGE-Timer"]
[]
[1,"Timer mit dem Seriellen-Kabel an die COM1 Schnittstelle anschließen"]
[2,"Kabel der Lichtschranken anschließen"]
[3,"Kippschalter auf \"C-timer\" stellen"]
[4,"Kippschalter nach oben auf \"programm + line test\" drücken und halten"]
[5,"EIN/AUS-Schalter auf Rückseite einschalten, nach 1 sec Kippschalter lösen"]
[6,"eventuell mit der gelben Taste drücken bis \"Pr.4\" angezeigt wird"]
[7,"um den Timer auf 0:00:00 zustellen rote und gelbe Taste gleichzeitig drücken"]
[8,"vor jeder neuen Messung wird so der Timer auf 0:00:00 gestellt"]
[9]
{"$rows_left_out":11}