{"text_format":"1","workbook":"xlsx","n_sheets":9,"sheets":["Eingabe","Gesamt","Ergebnis","Prog","ErgebnisEndlauf","Protokoll","Überschriften","Versionen","Hinweise"],"not_rendered":{"charts":0,"images":0,"macros":1,"external_links":0,"defined_names":4,"comments":1,"pivot_tables":0},"unopened":[{"sheet":"Prog","index":3,"reason":"part_missing"}],"bounds":{"document_bytes":16777216,"sheet_cells":100000,"rows_first":2000,"rows_last":500,"rows_between":2000,"halvings":0,"cell_chars":16384,"cell_head_chars":4096},"cells_cut":0,"cells_raw":0,"read":"whole","date_system":"1900"}

{"sheet":"Eingabe","index":0,"n_rows":22,"n_cols":12,"rows_kept":22,"cut":false,"hidden":false,"merged":[[1,1,1,5],[18,1,18,2],[19,1,19,2],[20,1,20,2],[18,4,18,5],[19,4,19,5],[20,4,20,5],[20,7,21,7],[20,8,21,8],[19,7,19,8],[21,1,21,3],[21,4,21,5]]}
[]
[null,"Zeitmessung Seifenkisten Derby Mettingen"]
[]
[]
[null,"V9.6"]
[null,null,"Bahn 1 PR",null,"Bahn 2 PB"]
[]
[null,"Lauf ",6,null,6]
[]
[null,"Start-Nr",702,517,999,null,null,null,null,null,null,"      "]
[null,null,null,null,null,null,null,null,null,null,null,"      "]
[null,"Zeit",42.3,null,38.97]
[null,null,null,null,null,null,null,null,null,null,null,"      "]
[null,null,"Hauptlauf / Endlauf  ?",null,"Hauptlauf",null,null,null,null,null,null,"      "]
[null,"Hauptlauf-Daten übertragen und gespeichert",null,null,null,null,null,null,null,null,null,"      "]
[null,null,null,null,null,"  ",null,null,null,null,null,"      "]
[null,{"$f":"LOOKUP(C10,Gesamt!A4:A1000,Gesamt!B4:B1000)","v":"Open"},null,null,null,{"$f":"LOOKUP(E10,Gesamt!A4:A1000,Gesamt!B4:B1000)","v":0}]
[]
[null,{"$f":"LOOKUP(C10,Gesamt!A4:A1000,Gesamt!E4:E1000)","v":"Robin"},null,null,{"$f":"LOOKUP(E10,Gesamt!A4:A1000,Gesamt!E4:E1000)","v":"! ! !"}]
[null,{"$f":"LOOKUP(C10,Gesamt!A4:A1000,Gesamt!D4:D1000)","v":"Neuhaus"},null,null,{"$f":"LOOKUP(E10,Gesamt!A4:A1000,Gesamt!D4:D1000)","v":"Einzel"},null,null,"Welcher Timer wird verwendet ?"]
[null,{"$f":"LOOKUP(C10,Gesamt!A4:A1000,Gesamt!F4:F1000)","v":"Mettingen"},null,null,{"$f":"LOOKUP(E10,Gesamt!A4:A1000,Gesamt!F4:F1000)","v":"Start"},null,null,1,"1 = ALGE\n2 = ZMM3"]
[null,"4402 PR  00:00:42.306",null,null,"4399 PB  00:00:38.974"]

{"sheet":"Gesamt","index":1,"n_rows":902,"n_cols":20,"rows_kept":902,"cut":false,"hidden":false,"merged":[[0,6,0,11],[0,13,0,18]]}
[null,null,null,null,null,null,"Hauptlauf",null,null,null,null,null,null,"Endlauf"]
[null,null,null,null,"Bahn 1","Bahn 2",1,1,1,1,1,1,"Lauf gewertet ?\n0 oder 1",1,1,1,1,1,1]
["Star\nNr","Renn\nKlasse","NRW\nWertung","Name","Vorname","Verein","1.\nLauf","2.\nLauf","3.\nLauf","4.\nLauf","5.\nLauf","6.\nLauf","Summe","1.\nEndlauf","2.\nEndlauf","3.\nEndlauf","4.\nEndlauf","5.\nEndlauf","6.\nEndlauf","Summe"]
[101,"JUN",null,"Thiemann","Jela","Stromberg",37.979999999999997,38.47,38.340000000000003,38.700000000000003,38.26,38.5,{"$f":"(G4*$G$2 +H4*$H$2+I4*$I$2+J4*$J$2 +K4*$K$2+L4*$L$2)","v":230.25},null,null,null,null,null,null,{"$f":"(N4*$N$2 +O4*$O$2+P4*$P$2+Q4*$Q$2 +R4*$R$2+S4*$S$2)","v":0}]
[102,"JUN",null,"Obermeyer","Theo","Mettingen",38.380000000000003,38.83,38.67,39.06,38.770000000000003,38.65,{"$f":"(G5*$G$2 +H5*$H$2+I5*$I$2+J5*$J$2 +K5*$K$2+L5*$L$2)","v":232.36},null,null,null,null,null,null,{"$f":"(N5*$N$2 +O5*$O$2+P5*$P$2+Q5*$Q$2 +R5*$R$2+S5*$S$2)","v":0}]
[103,"JUN",null,"Farwig","Alexander","Mettingen",38.32,38.61,39.03,39.04,38.92,39.06,232.98,null,null,null,null,null,null,0]
[104,"JUN",null,"Rickard","Julia","Billerbeck",38.590000000000003,38.86,39.15,39.15,39.020000000000003,38.93,233.7,null,null,null,null,null,null,0]
[105,"JUN",null,"Averkamp","Milan","Billerbeck",38.5,39.11,39.17,39.39,38.86,38.97,234,null,null,null,null,null,null,0]
[106,"JUN",null,"Lange","Peter","Mettingen",null,null,null,null,null,null,0,null,null,null,null,null,null,0]
[107,"JUN",null,"Teeken","Jorik","Mettingen",null,null,null,null,null,null,0,null,null,null,null,null,null,0]
[108,"JUN",null,"Bednarski","Frederik","Mettingen",null,null,null,null,null,null,0,null,null,null,null,null,null,0]
[109,"JUN",null,"Lüttmann","Merle","Mettingen",null,null,null,null,null,null,0,null,null,null,null,null,null,0]
[110,"JUN",null,"Bauer","Bella","Stromberg",null,null,null,null,null,null,0,null,null,null,null,null,null,0]
[111,"JUN",null,"Lange","Helene","Mettingen",null,null,null,null,null,null,0,null,null,null,null,null,null,0]
[112,"JUN",null,"Teeken","Lasse","Mettingen",null,null,null,null,null,null,0,null,null,null,null,null,null,0]
[113,"JUN",null,"Runde","Helga","Mettingen",null,null,null,null,null,null,0,null,null,null,null,null,null,0]
[114,"JUN",null,"Wolff","Sonja","Overath",null,null,null,null,null,null,0,null,null,null,null,null,null,0]
[115,"JUN",null,"Schröder","Alina","Billerbeck",null,null,null,null,null,null,0,null,null,null,null,null,null,0]
[116,"JUN",null,"Tzschoekel","Brian","Mettingen",39.49,39.770000000000003,39.96,39.83,39.200000000000003,39.26,237.51,null,null,null,null,null,null,0]
[117,"JUN",null,"Tzschoekel","Jolina","Mettingen",39.17,39.75,39.4,39.78,39.32,38.770000000000003,236.19,null,null,null,null,null,null,0]
[118,"JUN",null,"Allendorf","Lucie","Billerbeck",38.880000000000003,39.97,39.89,40.159999999999997,39.69,39.450000000000003,238.04,null,null,null,null,null,null,0]
[119,"JUN",null,"Löher","Sören","Stromberg",43.84,39.49,38.99,39.869999999999997,99,99,360.19,null,null,null,null,null,null,0]
[120,"JUN",null,"Suthe","Phil","Mettingen",39.08,38.89,38.97,39.01,38.85,38.979999999999997,233.78,null,null,null,null,null,null,0]
[121,"JUN",null,"Teeken","Lukas","Mettingen",38.74,38.799999999999997,38.71,39.07,38.729999999999997,38.97,233.02,null,null,null,null,null,null,0]
[122,"JUN",null,null,null,null,null,null,null,null,null,null,0,null,null,null,null,null,null,0]
[123,"JUN",null,null,null,null,null,null,null,null,null,null,0,null,null,null,null,null,null,0]
[124,"JUN",null,null,null,null,null,null,null,null,null,null,0,null,null,null,null,null,null,0]
[125,"JUN",null,null,null,null,null,null,null,null,null,null,0,null,null,null,null,null,null,0]
[126,"JUN",null,null,null,null,null,null,null,null,null,null,0,null,null,null,null,null,null,0]
[127,"JUN",null,null,null,null,null,null,null,null,null,null,0,null,null,null,null,null,null,0]
[128,null,null,null,null,null,null,null,null,null,null,null,0,null,null,null,null,null,null,0]
[129,null,null,null,null,null,null,null,null,null,null,null,0,null,null,null,null,null,null,0]
[130,null,null,null,null,null,null,null,null,null,null,null,0,null,null,null,null,null,null,0]
[131,null,null,null,null,null,null,null,null,null,null,null,0,null,null,null,null,null,null,0]
[132,null,null,null,null,null,null,null,null,null,null,null,0,null,null,null,null,null,null,0]
[133,null,null,null,null,null,null,null,null,null,null,null,0,null,null,null,null,null,null,0]
[134,null,null,null,null,null,null,null,null,null,null,null,0,null,null,null,null,null,null,0]
[135,null,null,null,null,null,null,null,null,null,null,null,0,null,null,null,null,null,null,0]
[136,null,null,null,null,null,null,null,null,null,null,null,0,null,null,null,null,null,null,0]
[137,null,null,null,null,null,null,null,null,null,null,null,0,null,null,null,null,null,null,0]
[138,null,null,null,null,null,null,null,null,null,null,null,0,null,null,null,null,null,null,0]
[139,null,null,null,null,null,null,null,null,null,null,null,0,null,null,null,null,null,null,0]
[140,null,null,null,null,null,null,null,null,null,null,null,0,null,null,null,null,null,null,0]
[141,null,null,null,null,null,null,null,null,null,null,null,0,null,null,null,null,null,null,0]
[142,null,null,null,null,null,null,null,null,null,null,null,0,null,null,null,null,null,null,0]
[143,null,null,null,null,null,null,null,null,null,null,null,0,null,null,null,null,null,null,0]
[144,null,null,null,null,null,null,null,null,null,null,null,0,null,null,null,null,null,null,0]
[145,null,null,null,null,null,null,null,null,null,null,null,0,null,null,null,null,null,null,0]
[146,null,null,null,null,null,null,null,null,null,null,null,0,null,null,null,null,null,null,0]
[147,null,null,null,null,null,null,null,null,null,null,null,0,null,null,null,null,null,null,0]
[148,null,null,null,null,null,null,null,null,null,null,null,0,null,null,null,null,null,null,0]
[149,null,null,null,null,null,null,null,null,null,null,null,0,null,null,null,null,null,null,0]
[150,null,null,null,null,null,null,null,null,null,null,null,0,null,null,null,null,null,null,0]
[151,null,null,null,null,null,null,null,null,null,null,null,0,null,null,null,null,null,null,0]
[152,null,null,null,null,null,null,null,null,null,null,null,0,null,null,null,null,null,null,0]
[153,null,null,null,null,null,null,null,null,null,null,null,0,null,null,null,null,null,null,0]
[154,null,null,null,null,null,null,null,null,null,null,null,0,null,null,null,null,null,null,0]
[155,null,null,null,null,null,null,null,null,null,null,null,0,null,null,null,null,null,null,0]
[156,null,null,null,null,null,null,null,null,null,null,null,0,null,null,null,null,null,null,0]
[157,null,null,null,null,null,null,null,null,null,null,null,0,null,null,null,null,null,null,0]
[158,null,null,null,null,null,null,null,null,null,null,null,0,null,null,null,null,null,null,0]
[159,null,null,null,null,null,null,null,null,null,null,null,0,null,null,null,null,null,null,0]
[160,null,null,null,null,null,null,null,null,null,null,null,0,null,null,null,null,null,null,0]
[161,null,null,null,null,null,null,null,null,null,null,null,0,null,null,null,null,null,null,0]
[162,null,null,null,null,null,null,null,null,null,null,null,0,null,null,null,null,null,null,0]
[163,null,null,null,null,null,null,null,null,null,null,null,0,null,null,null,null,null,null,0]
[164,null,null,null,null,null,null,null,null,null,null,null,0,null,null,null,null,null,null,0]
[165,null,null,null,null,null,null,null,null,null,null,null,0,null,null,null,null,null,null,0]
[166,null,null,null,null,null,null,null,null,null,null,null,{"$f":"(G69*$G$2 +H69*$H$2+I69*$I$2+J69*$J$2 +K69*$K$2+L69*$L$2)","v":0},null,null,null,null,null,null,{"$f":"(N69*$N$2 +O69*$O$2+P69*$P$2+Q69*$Q$2 +R69*$R$2+S69*$S$2)","v":0}]
[167,null,null,null,null,null,null,null,null,null,null,null,0,null,null,null,null,null,null,0]
[168,null,null,null,null,null,null,null,null,null,null,null,0,null,null,null,null,null,null,0]
[169,null,null,null,null,null,null,null,null,null,null,null,0,null,null,null,null,null,null,0]
[170,null,null,null,null,null,null,null,null,null,null,null,0,null,null,null,null,null,null,0]
[171,null,null,null,null,null,null,null,null,null,null,null,0,null,null,null,null,null,null,0]
[172,null,null,null,null,null,null,null,null,null,null,null,0,null,null,null,null,null,null,0]
[173,null,null,null,null,null,null,null,null,null,null,null,0,null,null,null,null,null,null,0]
[174,null,null,null,null,null,null,null,null,null,null,null,0,null,null,null,null,null,null,0]
[175,null,null,null,null,null,null,null,null,null,null,null,0,null,null,null,null,null,null,0]
[176,null,null,null,null,null,null,null,null,null,null,null,0,null,null,null,null,null,null,0]
[177,null,null,null,null,null,null,null,null,null,null,null,0,null,null,null,null,null,null,0]
[178,null,null,null,null,null,null,null,null,null,null,null,0,null,null,null,null,null,null,0]
[179,null,null,null,null,null,null,null,null,null,null,null,0,null,null,null,null,null,null,0]
[180,null,null,null,null,null,null,null,null,null,null,null,0,null,null,null,null,null,null,0]
[181,null,null,null,null,null,null,null,null,null,null,null,0,null,null,null,null,null,null,0]
[182,null,null,null,null,null,null,null,null,null,null,null,0,null,null,null,null,null,null,0]
[183,null,null,null,null,null,null,null,null,null,null,null,0,null,null,null,null,null,null,0]
[184,null,null,null,null,null,null,null,null,null,null,null,0,null,null,null,null,null,null,0]
[185,null,null,null,null,null,null,null,null,null,null,null,0,null,null,null,null,null,null,0]
[186,null,null,null,null,null,null,null,null,null,null,null,0,null,null,null,null,null,null,0]
[187,null,null,null,null,null,null,null,null,null,null,null,0,null,null,null,null,null,null,0]
[188,null,null,null,null,null,null,null,null,null,null,null,0,null,null,null,null,null,null,0]
[189,null,null,null,null,null,null,null,null,null,null,null,0,null,null,null,null,null,null,0]
[190,null,null,null,null,null,null,null,null,null,null,null,0,null,null,null,null,null,null,0]
[191,null,null,null,null,null,null,null,null,null,null,null,0,null,null,null,null,null,null,0]
[192,null,null,null,null,null,null,null,null,null,null,null,0,null,null,null,null,null,null,0]
[193,null,null,null,null,null,null,null,null,null,null,null,0,null,null,null,null,null,null,0]
[194,null,null,null,null,null,null,null,null,null,null,null,0,null,null,null,null,null,null,0]
[195,null,null,null,null,null,null,null,null,null,null,null,0,null,null,null,null,null,null,0]
[196,null,null,null,null,null,null,null,null,null,null,null,0,null,null,null,null,null,null,0]
[197,null,null,null,null,null,null,null,null,null,null,null,0,null,null,null,null,null,null,0]
[198,null,null,null,null,null,null,null,null,null,null,null,0,null,null,null,null,null,null,0]
[199,null,null,null,null,null,null,null,null,null,null,null,0,null,null,null,null,null,null,0]
[200,null,null,null,null,null,null,null,null,null,null,null,0,null,null,null,null,null,null,0]
[201,"Cup",null,"Klose 2",null,null,48.11,41,41.37,41.06,40.72,41.27,253.53,null,null,null,null,null,null,0]
[202,"Cup",null,"Klose 1",null,null,39.99,39.94,40.950000000000003,40.74,40.82,40.92,243.36,null,null,null,null,null,null,0]
[203,"Cup",null,"CDU Black Hawks",null,null,40.69,40.24,40.11,40.46,39.92,41.2,242.62,null,null,null,null,null,null,0]
[204,"Cup",null,"Schalker Freunde Mettingen",null,null,41.22,40.270000000000003,41.12,40.15,40.659999999999997,40.67,244.09,null,null,null,null,null,null,0]
[205,"Cup",null,"Seesterne 1",null,null,40.840000000000003,41.55,41.28,40.61,41.43,40.909999999999997,246.62,null,null,null,null,null,null,0]
[206,"Cup",null,"Seesterne 2",null,null,43.88,41.57,40.93,41.25,40.92,40.82,249.37,null,null,null,null,null,null,0]
[207,"Cup",null,"Kolping Racer",null,null,41.52,41,40.58,40.6,40.58,40.729999999999997,245.01,null,null,null,null,null,null,0]
[208,"Cup",null,"Doko Boys",null,null,41.63,40.659999999999997,41.02,40.659999999999997,41.2,41.34,246.51,null,null,null,null,null,null,0]
[209,"Cup",null,"Musikerstammtisch",null,null,41.71,41.15,41.28,41.08,41.02,41.01,247.25,null,null,null,null,null,null,0]
[210,"Cup",null,"Bürgermobil Mettingen",null,null,41.5,40.9,40.85,41.62,41.26,41.69,247.82,null,null,null,null,null,null,0]
[211,"Cup",null,"Eine Welt Mettingen",null,null,40.82,41.73,42.1,40.89,41.76,41.82,249.12,null,null,null,null,null,null,0]
[212,"Cup",null,"Die Schleichenden Handballer",null,null,41.04,40.51,41.22,40.700000000000003,40.28,40.200000000000003,243.95,null,null,null,null,null,null,0]
[213,"Cup",null,"Turbodüse",null,null,40.51,41.15,40.96,41.5,41.19,40.82,246.13,null,null,null,null,null,null,0]
[214,"Cup",null,"Brankolonski",null,null,40.65,41.53,40.98,40.74,40.31,40.950000000000003,245.16,null,null,null,null,null,null,0]
[215,"Cup",null,"Schwerkraftkrieger",null,null,40.54,41.4,40.89,41.14,41.02,39.97,244.96,null,null,null,null,null,null,0]
[216,"Cup",null,"Team 16",null,null,null,null,null,null,null,null,0,null,null,null,null,null,null,0]
[217,"Cup",null,"Team 17",null,null,null,null,null,null,null,null,0,null,null,null,null,null,null,0]
[218,"Cup",null,"Team 18",null,null,null,null,null,null,null,null,0,null,null,null,null,null,null,0]
[219,"Cup",null,"Team 19",null,null,null,null,null,null,null,null,0,null,null,null,null,null,null,0]
[220,"Cup",null,"Team 20",null," ",null,null,null,null,null,null,0,null,null,null,null,null,null,0]
[221,"Cup",null,"Team 21",null," ",null,null,null,null,null,null,0,null,null,null,null,null,null,0]
[222,"Cup",null,"Team 22",null," ",null,null,null,null,null,null,0,null,null,null,null,null,null,0]
[223,"Cup",null,"Team 23",null," ",null,null,null,null,null,null,0,null,null,null,null,null,null,0]
[224,"Cup",null,"Team 24",null," ",null,null,null,null,null,null,0,null,null,null,null,null,null,0]
[225,"Cup",null,"Team 25",null,null,null,null,null,null,null,null,0,null,null,null,null,null,null,0]
[226,"Cup",null,"Team 26",null,null,null,null,null,null,null,null,0,null,null,null,null,null,null,0]
[227,"Cup",null,"Team 27",null,null,null,null,null,null,null,null,0,null,null,null,null,null,null,0]
[228,"Cup",null,"Team 28",null,null,null,null,null,null,null,null,0,null,null,null,null,null,null,0]
[229,"Cup",null,"Team 29",null,null,null,null,null,null,null,null,0,null,null,null,null,null,null,0]
[230,"Cup",null,"Team 30",null,null,null,null,null,null,null,null,{"$f":"(G133*$G$2 +H133*$H$2+I133*$I$2+J133*$J$2 +K133*$K$2+L133*$L$2)","v":0},null,null,null,null,null,null,{"$f":"(N133*$N$2 +O133*$O$2+P133*$P$2+Q133*$Q$2 +R133*$R$2+S133*$S$2)","v":0}]
[231,"Cup",null,"Team 31",null,null,null,null,null,null,null,null,0,null,null,null,null,null,null,0]
[232,"Cup",null,"Team 32",null,null,null,null,null,null,null,null,0,null,null,null,null,null,null,0]
[233,"Cup",null,"Team 33",null,null,null,null,null,null,null,null,0,null,null,null,null,null,null,0]
[234,"Cup",null,null,null,null,null,null,null,null,null,null,0,null,null,null,null,null,null,0]
[235,"Cup",null,null,null,null,null,null,null,null,null,null,0,null,null,null,null,null,null,0]
[236,null,null,null,null,null,null,null,null,null,null,null,0,null,null,null,null,null,null,0]
[237,null,null,null,null,null,null,null,null,null,null,null,0,null,null,null,null,null,null,0]
[238,null,null,null,null,null,null,null,null,null,null,null,0,null,null,null,null,null,null,0]
[239,null,null,null,null,null,null,null,null,null,null,null,0,null,null,null,null,null,null,0]
[240,null,null,null,null,null,null,null,null,null,null,null,0,null,null,null,null,null,null,0]
[241,null,null,null,null,null,null,null,null,null,null,null,0,null,null,null,null,null,null,0]
[242,null,null,null,null,null,null,null,null,null,null,null,0,null,null,null,null,null,null,0]
[243,null,null,null,null,null,null,null,null,null,null,null,0,null,null,null,null,null,null,0]
[244,null,null,null,null,null,null,null,null,null,null,null,0,null,null,null,null,null,null,0]
[245,null,null,null,null,null,null,null,null,null,null,null,0,null,null,null,null,null,null,0]
[246,null,null,null,null,null,null,null,null,null,null,null,0,null,null,null,null,null,null,0]
[247,null,null,null,null,null,null,null,null,null,null,null,0,null,null,null,null,null,null,0]
[248,null,null,null,null,null,null,null,null,null,null,null,0,null,null,null,null,null,null,0]
[249,null,null,null,null,null,null,null,null,null,null,null,0,null,null,null,null,null,null,0]
[250,null,null,null,null,null,null,null,null,null,null,null,0,null,null,null,null,null,null,0]
[251,null,null,null,null,null,null,null,null,null,null,null,0,null,null,null,null,null,null,0]
[252,null,null,null,null,null,null,null,null,null,null,null,0,null,null,null,null,null,null,0]
[253,null,null,null,null,null,null,null,null,null,null,null,0,null,null,null,null,null,null,0]
[254,null,null,null,null,null,null,null,null,null,null,null,0,null,null,null,null,null,null,0]
[255,null,null,null,null,null,null,null,null,null,null,null,0,null,null,null,null,null,null,0]
[256,null,null,null,null,null,null,null,null,null,null,null,0,null,null,null,null,null,null,0]
[257,null,null,null,null,null,null,null,null,null,null,null,0,null,null,null,null,null,null,0]
[258,null,null,null,null,null,null,null,null,null,null,null,0,null,null,null,null,null,null,0]
[259,null,null,null,null,null,null,null,null,null,null,null,0,null,null,null,null,null,null,0]
[260,null,null,null,null,null,null,null,null,null,null,null,0,null,null,null,null,null,null,0]
[261,null,null,null,null,null,null,null,null,null,null,null,0,null,null,null,null,null,null,0]
[262,null,null,null,null,null,null,null,null,null,null,null,0,null,null,null,null,null,null,0]
[263,null,null,null,null,null,null,null,null,null,null,null,0,null,null,null,null,null,null,0]
[264,null,null,null,null,null,null,null,null,null,null,null,0,null,null,null,null,null,null,0]
[265,null,null,null,null,null,null,null,null,null,null,null,0,null,null,null,null,null,null,0]
[266,null,null,null,null,null,null,null,null,null,null,null,0,null,null,null,null,null,null,0]
[267,null,null,null,null,null,null,null,null,null,null,null,0,null,null,null,null,null,null,0]
[268,null,null,null,null,null,null,null,null,null,null,null,0,null,null,null,null,null,null,0]
[269,null,null,null,null,null,null,null,null,null,null,null,0,null,null,null,null,null,null,0]
[270,null,null,null,null,null,null,null,null,null,null,null,0,null,null,null,null,null,null,0]
[271,null,null,null,null,null,null,null,null,null,null,null,0,null,null,null,null,null,null,0]
[272,null,null,null,null,null,null,null,null,null,null,null,0,null,null,null,null,null,null,0]
[273,null,null,null,null,null,null,null,null,null,null,null,0,null,null,null,null,null,null,0]
[274,null,null,null,null,null,null,null,null,null,null,null,0,null,null,null,null,null,null,0]
[275,null,null,null,null,null,null,null,null,null,null,null,0,null,null,null,null,null,null,0]
[276,null,null,null,null,null,null,null,null,null,null,null,0,null,null,null,null,null,null,0]
[277,null,null,null,null,null,null,null,null,null,null,null,0,null,null,null,null,null,null,0]
[278,null,null,null,null,null,null,null,null,null,null,null,0,null,null,null,null,null,null,0]
[279,null,null,null,null,null,null,null,null,null,null,null,0,null,null,null,null,null,null,0]
[280,null,null,null,null,null,null,null,null,null,null,null,0,null,null,null,null,null,null,0]
[281,null,null,null,null,null,null,null,null,null,null,null,0,null,null,null,null,null,null,0]
[282,null,null,null,null,null,null,null,null,null,null,null,0,null,null,null,null,null,null,0]
[283,null,null,null,null,null,null,null,null,null,null,null,0,null,null,null,null,null,null,0]
[284,null,null,null,null,null,null,null,null,null,null,null,0,null,null,null,null,null,null,0]
[285,null,null,null,null,null,null,null,null,null,null,null,0,null,null,null,null,null,null,0]
[286,null,null,null,null,null,null,null,null,null,null,null,0,null,null,null,null,null,null,0]
[287,null,null,null,null,null,null,null,null,null,null,null,0,null,null,null,null,null,null,0]
[288,null,null,null,null,null,null,null,null,null,null,null,0,null,null,null,null,null,null,0]
[289,null,null,null,null,null,null,null,null,null,null,null,0,null,null,null,null,null,null,0]
[290,null,null,null,null,null,null,null,null,null,null,null,0,null,null,null,null,null,null,0]
[291,null,null,null,null,null,null,null,null,null,null,null,0,null,null,null,null,null,null,0]
[292,null,null,null,null,null,null,null,null,null,null,null,0,null,null,null,null,null,null,0]
[293,null,null,null,null,null,null,null,null,null,null,null,0,null,null,null,null,null,null,0]
[294,null,null,null,null,null,null,null,null,null,null,null,{"$f":"(G197*$G$2 +H197*$H$2+I197*$I$2+J197*$J$2 +K197*$K$2+L197*$L$2)","v":0},null,null,null,null,null,null,{"$f":"(N197*$N$2 +O197*$O$2+P197*$P$2+Q197*$Q$2 +R197*$R$2+S197*$S$2)","v":0}]
[295,null,null,null,null,null,null,null,null,null,null,null,0,null,null,null,null,null,null,0]
[296,null,null,null,null,null,null,null,null,null,null,null,0,null,null,null,null,null,null,0]
[297,null,null,null,null,null,null,null,null,null,null,null,0,null,null,null,null,null,null,0]
[298,null,null,null,null,null,null,null,null,null,null,null,0,null,null,null,null,null,null,0]
[299,null,null,null,null,null,null,null,null,null,null,null,0,null,null,null,null,null,null,0]
[300,null,null,null,null,null,null,null,null,null,null,null,0,null,null,null,null,null,null,0]
[301,"SEN"," ","Lemmen","Jan","Stromberg",37.31,37.53,37.380000000000003,37.54,37.28,37.56,224.6,null,null,null,null,null,null,0]
[302,"SEN",null,"Geschka","Hendrik","Overath",37.43,37.42,37.47,37.5,37.26,37.4,224.48,null,null,null,null,null,null,0]
[303,"SEN",null,"Trompeter","Jonathan","Overath",null,null,null,null,null,null,0,null,null,null,null,null,null,0]
[304,"SEN",null,"Steinberg","Kimberly","Billerbeck",37.340000000000003,37.54,37.42,37.56,37.44,37.479999999999997,224.78,null,null,null,null,null,null,0]
[305,"SEN",null,"Lampe","Ida","Mettingen",37.35,37.479999999999997,37.31,37.57,37.479999999999997,37.47,224.66,null,null,null,null,null,null,0]
[306,"SEN",null,"Meyer","Hugo","Mettingen",37.6,37.72,37.479999999999997,37.75,37.909999999999997,37.94,226.4,null,null,null,null,null,null,0]
[307,"SEN",null,"Paschedag","Lena","Stromberg",null,null,null,null,null,null,0,null,null,null,null,null,null,0]
[308,"SEN",null,"Paschedag","Tabea","Stromberg",null,null,null,null,null,null,0,null,null,null,null,null,null,0]
[309,"SEN",null,"Freudenstein","Romy","Mettingen",37.54,37.619999999999997,37.450000000000003,37.78,37.770000000000003,37.729999999999997,225.89,null,null,null,null,null,null,0]
[310,"SEN",null,"Schneiders","Leo","Mettingen",null,null,null,null,null,null,0,null,null,null,null,null,null,0]
[311,"SEN",null,"Reick","Jule","Mettingen",null,null,null,null,null,null,0,null,null,null,null,null,null,0]
[312,"SEN",null,"Bednarski","Jonathan","Mettingen",null,null,null,null,null,null,0,null,null,null,null,null,null,0]
[313,"SEN",null,null,null,null,null,null,null,null,null,null,0,null,null,null,null,null,null,0]
[314,"SEN",null,"Wolff","Daniel","Overath",null,null,null,null,null,null,0,null,null,null,null,null,null,0]
[315,"SEN",null,"Lehmeier","Ben","Mettingen",37.64,37.700000000000003,37.700000000000003,37.9,37.9,37.9,226.74,null,null,null,null,null,null,0]
[316,"SEN",null,null,null,null,null,null,null,null,null,null,0,null,null,null,null,null,null,0]
[317,"SEN",null,null,null,null,null,null,null,null,null,null,0,null,null,null,null,null,null,0]
[318,"SEN",null,null,null,null,null,null,null,null,null,null,0,null,null,null,null,null,null,0]
[319,"SEN",null,null,null,null,null,null,null,null,null,null,0,null,null,null,null,null,null,0]
[320,"SEN",null,null,null,null,null,null,null,null,null,null,0,null,null,null,null,null,null,0]
[321,"SEN",null,null,null,null,null,null,null,null,null,null,0,null,null,null,null,null,null,0]
[322,"SEN",null,null,null,null,null,null,null,null,null,null,0,null,null,null,null,null,null,0]
[323,"SEN",null,null,null,null,null,null,null,null,null,null,0,null,null,null,null,null,null,0]
[324,null,null,null,null,null,null,null,null,null,null,null,0,null,null,null,null,null,null,0]
[325,null,null,null,null,null,null,null,null,null,null,null,0,null,null,null,null,null,null,0]
[326,null,null,null,null,null,null,null,null,null,null,null,0,null,null,null,null,null,null,0]
[327,null,null,null,null,null,null,null,null,null,null,null,0,null,null,null,null,null,null,0]
[328,null,null,null,null,null,null,null,null,null,null,null,0,null,null,null,null,null,null,0]
[329,null,null,null,null,null,null,null,null,null,null,null,0,null,null,null,null,null,null,0]
[330,null,null,null,null,null,null,null,null,null,null,null,0,null,null,null,null,null,null,0]
[331,null,null,null,null,null,null,null,null,null,null,null,0,null,null,null,null,null,null,0]
[332,null,null,null,null,null,null,null,null,null,null,null,0,null,null,null,null,null,null,0]
[333,null,null,null,null,null,null,null,null,null,null,null,0,null,null,null,null,null,null,0]
[334,null,null,null,null,null,null,null,null,null,null,null,0,null,null,null,null,null,null,0]
[335,null,null,null,null,null,null,null,null,null,null,null,0,null,null,null,null,null,null,0]
[336,null,null,null,null,null,null,null,null,null,null,null,0,null,null,null,null,null,null,0]
[337,null,null,null,null,null,null,null,null,null,null,null,0,null,null,null,null,null,null,0]
[338,null,null,null,null,null,null,null,null,null,null,null,0,null,null,null,null,null,null,0]
[339,null,null,null,null,null,null,null,null,null,null,null,0,null,null,null,null,null,null,0]
[340,null,null,null,null,null,null,null,null,null,null,null,0,null,null,null,null,null,null,0]
[341,null,null,null,null,null,null,null,null,null,null,null,0,null,null,null,null,null,null,0]
[342,null,null,null,null,null,null,null,null,null,null,null,0,null,null,null,null,null,null,0]
[343,null,null,null,null,null,null,null,null,null,null,null,0,null,null,null,null,null,null,0]
[344,null,null,null,null,null,null,null,null,null,null,null,0,null,null,null,null,null,null,0]
[345,null,null,null,null,null,null,null,null,null,null,null,0,null,null,null,null,null,null,0]
[346,null,null,null,null,null,null,null,null,null,null,null,0,null,null,null,null,null,null,0]
[347,null,null,null,null,null,null,null,null,null,null,null,0,null,null,null,null,null,null,0]
[348,null,null,null,null,null,null,null,null,null,null,null,0,null,null,null,null,null,null,0]
[349,null,null,null,null,null,null,null,null,null,null,null,0,null,null,null,null,null,null,0]
[350,null,null,null,null,null,null,null,null,null,null,null,0,null,null,null,null,null,null,0]
[351,null,null,null,null,null,null,null,null,null,null,null,0,null,null,null,null,null,null,0]
[352,null,null,null,null,null,null,null,null,null,null,null,0,null,null,null,null,null,null,0]
[353,null,null,null,null,null,null,null,null,null,null,null,0,null,null,null,null,null,null,0]
[354,null,null,null,null,null,null,null,null,null,null,null,0,null,null,null,null,null,null,0]
[355,null,null,null,null,null,null,null,null,null,null,null,0,null,null,null,null,null,null,0]
[356,null,null,null,null,null,null,null,null,null,null,null,0,null,null,null,null,null,null,0]
[357,null,null,null,null,null,null,null,null,null,null,null,0,null,null,null,null,null,null,0]
[358,null,null,null,null,null,null,null,null,null,null,null,{"$f":"(G261*$G$2 +H261*$H$2+I261*$I$2+J261*$J$2 +K261*$K$2+L261*$L$2)","v":0},null,null,null,null,null,null,{"$f":"(N261*$N$2 +O261*$O$2+P261*$P$2+Q261*$Q$2 +R261*$R$2+S261*$S$2)","v":0}]
[359,null,null,null,null,null,null,null,null,null,null,null,0,null,null,null,null,null,null,0]
[360,null,null,null,null,null,null,null,null,null,null,null,0,null,null,null,null,null,null,0]
[361,null,null,null,null,null,null,null,null,null,null,null,0,null,null,null,null,null,null,0]
[362,null,null,null,null,null,null,null,null,null,null,null,0,null,null,null,null,null,null,0]
[363,null,null,null,null,null,null,null,null,null,null,null,0,null,null,null,null,null,null,0]
[364,null,null,null,null,null,null,null,null,null,null,null,0,null,null,null,null,null,null,0]
[365,null,null,null,null,null,null,null,null,null,null,null,0,null,null,null,null,null,null,0]
[366,null,null,null,null,null,null,null,null,null,null,null,0,null,null,null,null,null,null,0]
[367,null,null,null,null,null,null,null,null,null,null,null,0,null,null,null,null,null,null,0]
[368,null,null,null,null,null,null,null,null,null,null,null,0,null,null,null,null,null,null,0]
[369,null,null,null,null,null,null,null,null,null,null,null,0,null,null,null,null,null,null,0]
[370,null,null,null,null,null,null,null,null,null,null,null,0,null,null,null,null,null,null,0]
[371,null,null,null,null,null,null,null,null,null,null,null,0,null,null,null,null,null,null,0]
[372,null,null,null,null,null,null,null,null,null,null,null,0,null,null,null,null,null,null,0]
[373,null,null,null,null,null,null,null,null,null,null,null,0,null,null,null,null,null,null,0]
[374,null,null,null,null,null,null,null,null,null,null,null,0,null,null,null,null,null,null,0]
[375,null,null,null,null,null,null,null,null,null,null,null,0,null,null,null,null,null,null,0]
[376,null,null,null,null,null,null,null,null,null,null,null,0,null,null,null,null,null,null,0]
[377,null,null,null,null,null,null,null,null,null,null,null,0,null,null,null,null,null,null,0]
[378,null,null,null,null,null,null,null,null,null,null,null,0,null,null,null,null,null,null,0]
[379,null,null,null,null,null,null,null,null,null,null,null,0,null,null,null,null,null,null,0]
[380,null,null,null,null,null,null,null,null,null,null,null,0,null,null,null,null,null,null,0]
[381,null,null,null,null,null,null,null,null,null,null,null,0,null,null,null,null,null,null,0]
[382,null,null,null,null,null,null,null,null,null,null,null,0,null,null,null,null,null,null,0]
[383,null,null,null,null,null,null,null,null,null,null,null,0,null,null,null,null,null,null,0]
[384,null,null,null,null,null,null,null,null,null,null,null,0,null,null,null,null,null,null,0]
[385,null,null,null,null,null,null,null,null,null,null,null,0,null,null,null,null,null,null,0]
[386,null,null,null,null,null,null,null,null,null,null,null,0,null,null,null,null,null,null,0]
[387,null,null,null,null,null,null,null,null,null,null,null,0,null,null,null,null,null,null,0]
[388,null,null,null,null,null,null,null,null,null,null,null,0,null,null,null,null,null,null,0]
[389,null,null,null,null,null,null,null,null,null,null,null,0,null,null,null,null,null,null,0]
[390,null,null,null,null,null,null,null,null,null,null,null,0,null,null,null,null,null,null,0]
[391,null,null,null,null,null,null,null,null,null,null,null,0,null,null,null,null,null,null,0]
[392,null,null,null,null,null,null,null,null,null,null,null,0,null,null,null,null,null,null,0]
[393,null,null,null,null,null,null,null,null,null,null,null,0,null,null,null,null,null,null,0]
[394,null,null,null,null,null,null,null,null,null,null,null,0,null,null,null,null,null,null,0]
[395,null,null,null,null,null,null,null,null,null,null,null,0,null,null,null,null,null,null,0]
[396,null,null,null,null,null,null,null,null,null,null,null,0,null,null,null,null,null,null,0]
[397,null,null,null,null,null,null,null,null,null,null,null,0,null,null,null,null,null,null,0]
[398,null,null,null,null,null,null,null,null,null,null,null,0,null,null,null,null,null,null,0]
[399,null,null,null,null,null,null,null,null,null,null,null,0,null,null,null,null,null,null,0]
[400,null,null,null,null,null,null,null,null,null,null,null,0,null,null,null,null,null,null,0]
[401,null,null,null,null,null,null,null,null,null,null,null,0,null,null,null,null,null,null,0]
[402,null,null,null,null,null,null,null,null,null,null,null,0,null,null,null,null,null,null,0]
[403,null,null,null,null,null,null,null,null,null,null,null,0,null,null,null,null,null,null,0]
[404,null,null,null,null,null,null,null,null,null,null,null,0,null,null,null,null,null,null,0]
[405,null,null,null,null,null,null,null,null,null,null,null,0,null,null,null,null,null,null,0]
[406,null,null,null,null,null,null,null,null,null,null,null,0,null,null,null,null,null,null,0]
[407,null,null,null,null,null,null,null,null,null,null,null,0,null,null,null,null,null,null,0]
[408,null,null,null,null,null,null,null,null,null,null,null,0,null,null,null,null,null,null,0]
[409,null,null,null,null,null,null,null,null,null,null,null,0,null,null,null,null,null,null,0]
[410,null,null,null,null,null,null,null,null,null,null,null,0,null,null,null,null,null,null,0]
[411,null,null,null,null,null,null,null,null,null,null,null,0,null,null,null,null,null,null,0]
[412,null,null,null,null,null,null,null,null,null,null,null,0,null,null,null,null,null,null,0]
[413,null,null,null,null,null,null,null,null,null,null,null,0,null,null,null,null,null,null,0]
[414,null,null,null,null,null,null,null,null,null,null,null,0,null,null,null,null,null,null,0]
[415,null,null,null,null,null,null,null,null,null,null,null,0,null,null,null,null,null,null,0]
[416,null,null,null,null,null,null,null,null,null,null,null,0,null,null,null,null,null,null,0]
[417,null,null,null,null,null,null,null,null,null,null,null,0,null,null,null,null,null,null,0]
[418,null,null,null,null,null,null,null,null,null,null,null,0,null,null,null,null,null,null,0]
[419,null,null,null,null,null,null,null,null,null,null,null,0,null,null,null,null,null,null,0]
[420,null,null,null,null,null,null,null,null,null,null,null,0,null,null,null,null,null,null,0]
[421,null,null,null,null,null,null,null,null,null,null,null,0,null,null,null,null,null,null,0]
[422,null,null,null,null,null,null,null,null,null,null,null,{"$f":"(G325*$G$2 +H325*$H$2+I325*$I$2+J325*$J$2 +K325*$K$2+L325*$L$2)","v":0},null,null,null,null,null,null,{"$f":"(N325*$N$2 +O325*$O$2+P325*$P$2+Q325*$Q$2 +R325*$R$2+S325*$S$2)","v":0}]
[423,null,null,null,null,null,null,null,null,null,null,null,0,null,null,null,null,null,null,0]
[424,null,null,null,null,null,null,null,null,null,null,null,0,null,null,null,null,null,null,0]
[425,null,null,null,null,null,null,null,null,null,null,null,0,null,null,null,null,null,null,0]
[426,null,null,null,null,null,null,null,null,null,null,null,0,null,null,null,null,null,null,0]
[427,null,null,null,null,null,null,null,null,null,null,null,0,null,null,null,null,null,null,0]
[428,null,null,null,null,null,null,null,null,null,null,null,0,null,null,null,null,null,null,0]
[429,null,null,null,null,null,null,null,null,null,null,null,0,null,null,null,null,null,null,0]
[430,null,null,null,null,null,null,null,null,null,null,null,0,null,null,null,null,null,null,0]
[431,null,null,null,null,null,null,null,null,null,null,null,0,null,null,null,null,null,null,0]
[432,null,null,null,null,null,null,null,null,null,null,null,0,null,null,null,null,null,null,0]
[433,null,null,null,null,null,null,null,null,null,null,null,0,null,null,null,null,null,null,0]
[434,null,null,null,null,null,null,null,null,null,null,null,0,null,null,null,null,null,null,0]
[435,null,null,null,null,null,null,null,null,null,null,null,0,null,null,null,null,null,null,0]
[436,null,null,null,null,null,null,null,null,null,null,null,0,null,null,null,null,null,null,0]
[437,null,null,null,null,null,null,null,null,null,null,null,0,null,null,null,null,null,null,0]
[438,null,null,null,null,null,null,null,null,null,null,null,0,null,null,null,null,null,null,0]
[439,null,null,null,null,null,null,null,null,null,null,null,0,null,null,null,null,null,null,0]
[440,null,null,null,null,null,null,null,null,null,null,null,0,null,null,null,null,null,null,0]
[441,null,null,null,null,null,null,null,null,null,null,null,0,null,null,null,null,null,null,0]
[442,null,null,null,null,null,null,null,null,null,null,null,0,null,null,null,null,null,null,0]
[443,null,null,null,null,null,null,null,null,null,null,null,0,null,null,null,null,null,null,0]
[444,null,null,null,null,null,null,null,null,null,null,null,0,null,null,null,null,null,null,0]
[445,null,null,null,null,null,null,null,null,null,null,null,0,null,null,null,null,null,null,0]
[446,null,null,null,null,null,null,null,null,null,null,null,0,null,null,null,null,null,null,0]
[447,null,null,null,null,null,null,null,null,null,null,null,0,null,null,null,null,null,null,0]
[448,null,null,null,null,null,null,null,null,null,null,null,0,null,null,null,null,null,null,0]
[449,null,null,null,null,null,null,null,null,null,null,null,0,null,null,null,null,null,null,0]
[450,null,null,null,null,null,null,null,null,null,null,null,0,null,null,null,null,null,null,0]
[451,null,null,null,null,null,null,null,null,null,null,null,0,null,null,null,null,null,null,0]
[452,null,null,null,null,null,null,null,null,null,null,null,0,null,null,null,null,null,null,0]
[453,null,null,null,null,null,null,null,null,null,null,null,0,null,null,null,null,null,null,0]
[454,null,null,null,null,null,null,null,null,null,null,null,0,null,null,null,null,null,null,0]
[455,null,null,null,null,null,null,null,null,null,null,null,0,null,null,null,null,null,null,0]
[456,null,null,null,null,null,null,null,null,null,null,null,0,null,null,null,null,null,null,0]
[457,null,null,null,null,null,null,null,null,null,null,null,0,null,null,null,null,null,null,0]
[458,null,null,null,null,null,null,null,null,null,null,null,0,null,null,null,null,null,null,0]
[459,null,null,null,null,null,null,null,null,null,null,null,0,null,null,null,null,null,null,0]
[460,null,null,null,null,null,null,null,null,null,null,null,0,null,null,null,null,null,null,0]
[461,null,null,null,null,null,null,null,null,null,null,null,0,null,null,null,null,null,null,0]
[462,null,null,null,null,null,null,null,null,null,null,null,0,null,null,null,null,null,null,0]
[463,null,null,null,null,null,null,null,null,null,null,null,0,null,null,null,null,null,null,0]
[464,null,null,null,null,null,null,null,null,null,null,null,0,null,null,null,null,null,null,0]
[465,null,null,null,null,null,null,null,null,null,null,null,0,null,null,null,null,null,null,0]
[466,null,null,null,null,null,null,null,null,null,null,null,0,null,null,null,null,null,null,0]
[467,null,null,null,null,null,null,null,null,null,null,null,0,null,null,null,null,null,null,0]
[468,null,null,null,null,null,null,null,null,null,null,null,0,null,null,null,null,null,null,0]
[469,null,null,null,null,null,null,null,null,null,null,null,0,null,null,null,null,null,null,0]
[470,null,null,null,null,null,null,null,null,null,null,null,0,null,null,null,null,null,null,0]
[471,null,null,null,null,null,null,null,null,null,null,null,0,null,null,null,null,null,null,0]
[472,null,null,null,null,null,null,null,null,null,null,null,0,null,null,null,null,null,null,0]
[473,null,null,null,null,null,null,null,null,null,null,null,0,null,null,null,null,null,null,0]
[474,null,null,null,null,null,null,null,null,null,null,null,0,null,null,null,null,null,null,0]
[475,null,null,null,null,null,null,null,null,null,null,null,0,null,null,null,null,null,null,0]
[476,null,null,null,null,null,null,null,null,null,null,null,0,null,null,null,null,null,null,0]
[477,null,null,null,null,null,null,null,null,null,null,null,0,null,null,null,null,null,null,0]
[478,null,null,null,null,null,null,null,null,null,null,null,0,null,null,null,null,null,null,0]
[479,null,null,null,null,null,null,null,null,null,null,null,0,null,null,null,null,null,null,0]
[480,null,null,null,null,null,null,null,null,null,null,null,0,null,null,null,null,null,null,0]
[481,null,null,null,null,null,null,null,null,null,null,null,0,null,null,null,null,null,null,0]
[482,null,null,null,null,null,null,null,null,null,null,null,0,null,null,null,null,null,null,0]
[483,null,null,null,null,null,null,null,null,null,null,null,0,null,null,null,null,null,null,0]
[484,null,null,null,null,null,null,null,null,null,null,null,0,null,null,null,null,null,null,0]
[485,null,null,null,null,null,null,null,null,null,null,null,0,null,null,null,null,null,null,0]
[486,null,null,null,null,null,null,null,null,null,null,null,{"$f":"(G389*$G$2 +H389*$H$2+I389*$I$2+J389*$J$2 +K389*$K$2+L389*$L$2)","v":0},null,null,null,null,null,null,{"$f":"(N389*$N$2 +O389*$O$2+P389*$P$2+Q389*$Q$2 +R389*$R$2+S389*$S$2)","v":0}]
[487,null,null,null,null,null,null,null,null,null,null,null,0,null,null,null,null,null,null,0]
[488,null,null,null,null,null,null,null,null,null,null,null,0,null,null,null,null,null,null,0]
[489,null,null,null,null,null,null,null,null,null,null,null,0,null,null,null,null,null,null,0]
[490,null,null,null,null,null,null,null,null,null,null,null,0,null,null,null,null,null,null,0]
[491,null,null,null,null,null,null,null,null,null,null,null,0,null,null,null,null,null,null,0]
[492,null,null,null,null,null,null,null,null,null,null,null,0,null,null,null,null,null,null,0]
[493,null,null,null,null,null,null,null,null,null,null,null,0,null,null,null,null,null,null,0]
[494,null,null,null,null,null,null,null,null,null,null,null,0,null,null,null,null,null,null,0]
[495,null,null,null,null,null,null,null,null,null,null,null,0,null,null,null,null,null,null,0]
[496,null,null,null,null,null,null,null,null,null,null,null,0,null,null,null,null,null,null,0]
[497,null,null,null,null,null,null,null,null,null,null,null,0,null,null,null,null,null,null,0]
[498,null,null,null,null,null,null,null,null,null,null,null,0,null,null,null,null,null,null,0]
[499,null,null,null,null,null,null,null,null,null,null,null,0,null,null,null,null,null,null,0]
[500,null,null,null,null,null,null,null,null,null,null,null,0,null,null,null,null,null,null,0]
[501,"EXL",null,"Crook","Florian","Mettingen",37.9,38.04,38.03,38.18,38.130000000000003,38.1,228.38,null,null,null,null,null,null,0]
[502,"EXL",null,"Ricker","Jana-Lena","Billerbeck",37.869999999999997,37.86,38.15,38.090000000000003,38.17,38.1,228.24,null,null,null,null,null,null,0]
[503,"EXL",null,"Schier","Finn","Stromberg",38.35,38.46,38.479999999999997,38.42,38.71,38.78,231.2,null,null,null,null,null,null,0]
[504,"EXL",null,"Helms","Markus","Billerbeck",37.72,37.729999999999997,37.78,37.83,37.869999999999997,37.96,226.89,null,null,null,null,null,null,0]
[505,"EXL",null,"Ricker","Sarah","Billerbeck",37.89,37.96,37.99,38.28,38.14,38.299999999999997,228.56,null,null,null,null,null,null,0]
[506,"EXL",null,"Marx","Fabian","ConAction",37.659999999999997,37.840000000000003,38.11,37.94,38.15,38.01,227.71,null,null,null,null,null,null,0]
[507,"EXL",null,"Rohls","Sebastian","Stromberg",37.380000000000003,37.56,37.590000000000003,37.76,37.53,37.81,225.63,null,null,null,null,null,null,0]
[508,"EXL",null,"Lammers","Laura","Billerbeck",null,null,null,null,null,null,0,null,null,null,null,null,null,0]
[509,"EXL",null,"Evers","Maria","Bergkamen",null,null,null,null,null,null,0,null,null,null,null,null,null,0]
[510,"EXL",null,"Voß","Marie-Charlotte","Bergkamen",37.5,37.47,37.64,37.68,37.67,37.74,225.7,null,null,null,null,null,null,0]
[511,"EXL",null,"Freudenstein","Rieke","Mettingen",null,null,null,null,null,null,0,null,null,null,null,null,null,0]
[512,"EXL",null,"Zaruba","Pia","Mettingen",37.64,37.619999999999997,37.700000000000003,37.74,37.549999999999997,37.82,226.07,null,null,null,null,null,null,0]
[513,"EXL",null,"Lampe","Pia","Mettingen",37.92,37.78,38,38.159999999999997,37.85,38.020000000000003,227.73,null,null,null,null,null,null,0]
[514,"EXL",null,"Lutter","Astrid","ConAction",null,null,null,null,null,null,0,null,null,null,null,null,null,0]
[515,"EXL",null,"Lange","Florian","Mettingen",37.86,38.130000000000003,38.119999999999997,38.21,38.03,38.409999999999997,228.76,null,null,null,null,null,null,0]
[516,"EXL",null,"Rosenkranz","Justus","Overath",37.99,37.9,38.1,38.049999999999997,37.96,38.14,228.14,null,null,null,null,null,null,0]
[517,"EXL",null,"Harb","Suhaib","Mettingen",37.57,37.61,37.76,37.61,37.56,37.770000000000003,225.88,null,null,null,null,null,null,0]
[518,"EXL",null,null,null,null,null,null,null,null,null,null,0,null,null,null,null,null,null,0]
[519,"EXL",null,null,null,null,null,null,null,null,null,null,0,null,null,null,null,null,null,0]
[520,"EXL",null,null,null,null,null,null,null,null,null,null,0,null,null,null,null,null,null,0]
[521,"EXL",null,null,null,null,null,null,null,null,null,null,0,null,null,null,null,null,null,0]
[522,"EXL",null,null,null,null,null,null,null,null,null,null,0,null,null,null,null,null,null,0]
[523,"EXL",null,null,null,null,null,null,null,null,null,null,0,null,null,null,null,null,null,0]
[524,"EXL",null,null,null,null,null,null,null,null,null,null,0,null,null,null,null,null,null,0]
[525,null,null,null,null,null,null,null,null,null,null,null,0,null,null,null,null,null,null,0]
[526,null,null,null,null,null,null,null,null,null,null,null,0,null,null,null,null,null,null,0]
[527,null,null,null,null,null,null,null,null,null,null,null,0,null,null,null,null,null,null,0]
[528,null,null,null,null,null,null,null,null,null,null,null,0,null,null,null,null,null,null,0]
[529,null,null,null,null,null,null,null,null,null,null,null,0,null,null,null,null,null,null,0]
[530,null,null,null,null,null,null,null,null,null,null,null,0,null,null,null,null,null,null,0]
[531,null,null,null,null,null,null,null,null,null,null,null,0,null,null,null,null,null,null,0]
[532,null,null,null,null,null,null,null,null,null,null,null,0,null,null,null,null,null,null,0]
[533,null,null,null,null,null,null,null,null,null,null,null,0,null,null,null,null,null,null,0]
[534,null,null,null,null,null,null,null,null,null,null,null,0,null,null,null,null,null,null,0]
[535,null,null,null,null,null,null,null,null,null,null,null,0,null,null,null,null,null,null,0]
[536,null,null,null,null,null,null,null,null,null,null,null,0,null,null,null,null,null,null,0]
[537,null,null,null,null,null,null,null,null,null,null,null,0,null,null,null,null,null,null,0]
[538,null,null,null,null,null,null,null,null,null,null,null,0,null,null,null,null,null,null,0]
[539,null,null,null,null,null,null,null,null,null,null,null,0,null,null,null,null,null,null,0]
[540,null,null,null,null,null,null,null,null,null,null,null,0,null,null,null,null,null,null,0]
[541,null,null,null,null,null,null,null,null,null,null,null,0,null,null,null,null,null,null,0]
[542,null,null,null,null,null,null,null,null,null,null,null,0,null,null,null,null,null,null,0]
[543,null,null,null,null,null,null,null,null,null,null,null,0,null,null,null,null,null,null,0]
[544,null,null,null,null,null,null,null,null,null,null,null,0,null,null,null,null,null,null,0]
[545,null,null,null,null,null,null,null,null,null,null,null,0,null,null,null,null,null,null,0]
[546,null,null,null,null,null,null,null,null,null,null,null,0,null,null,null,null,null,null,0]
[547,null,null,null,null,null,null,null,null,null,null,null,0,null,null,null,null,null,null,0]
[548,null,null,null,null,null,null,null,null,null,null,null,0,null,null,null,null,null,null,0]
[549,null,null,null,null,null,null,null,null,null,null,null,0,null,null,null,null,null,null,0]
[550,null,null,null,null,null,null,null,null,null,null,null,{"$f":"(G453*$G$2 +H453*$H$2+I453*$I$2+J453*$J$2 +K453*$K$2+L453*$L$2)","v":0},null,null,null,null,null,null,{"$f":"(N453*$N$2 +O453*$O$2+P453*$P$2+Q453*$Q$2 +R453*$R$2+S453*$S$2)","v":0}]
[551,null,null,null,null,null,null,null,null,null,null,null,0,null,null,null,null,null,null,0]
[552,null,null,null,null,null,null,null,null,null,null,null,0,null,null,null,null,null,null,0]
[553,null,null,null,null,null,null,null,null,null,null,null,0,null,null,null,null,null,null,0]
[554,null,null,null,null,null,null,null,null,null,null,null,0,null,null,null,null,null,null,0]
[555,null,null,null,null,null,null,null,null,null,null,null,0,null,null,null,null,null,null,0]
[556,null,null,null,null,null,null,null,null,null,null,null,0,null,null,null,null,null,null,0]
[557,null,null,null,null,null,null,null,null,null,null,null,0,null,null,null,null,null,null,0]
[558,null,null,null,null,null,null,null,null,null,null,null,0,null,null,null,null,null,null,0]
[559,null,null,null,null,null,null,null,null,null,null,null,0,null,null,null,null,null,null,0]
[560,null,null,null,null,null,null,null,null,null,null,null,0,null,null,null,null,null,null,0]
[561,null,null,null,null,null,null,null,null,null,null,null,0,null,null,null,null,null,null,0]
[562,null,null,null,null,null,null,null,null,null,null,null,0,null,null,null,null,null,null,0]
[563,null,null,null,null,null,null,null,null,null,null,null,0,null,null,null,null,null,null,0]
[564,null,null,null,null,null,null,null,null,null,null,null,0,null,null,null,null,null,null,0]
[565,null,null,null,null,null,null,null,null,null,null,null,0,null,null,null,null,null,null,0]
[566,null,null,null,null,null,null,null,null,null,null,null,0,null,null,null,null,null,null,0]
[567,null,null,null,null,null,null,null,null,null,null,null,0,null,null,null,null,null,null,0]
[568,null,null,null,null,null,null,null,null,null,null,null,0,null,null,null,null,null,null,0]
[569,null,null,null,null,null,null,null,null,null,null,null,0,null,null,null,null,null,null,0]
[570,null,null,null,null,null,null,null,null,null,null,null,0,null,null,null,null,null,null,0]
[571,null,null,null,null,null,null,null,null,null,null,null,0,null,null,null,null,null,null,0]
[572,null,null,null,null,null,null,null,null,null,null,null,0,null,null,null,null,null,null,0]
[573,null,null,null,null,null,null,null,null,null,null,null,0,null,null,null,null,null,null,0]
[574,null,null,null,null,null,null,null,null,null,null,null,0,null,null,null,null,null,null,0]
[575,null,null,null,null,null,null,null,null,null,null,null,0,null,null,null,null,null,null,0]
[576,null,null,null,null,null,null,null,null,null,null,null,0,null,null,null,null,null,null,0]
[577,null,null,null,null,null,null,null,null,null,null,null,0,null,null,null,null,null,null,0]
[578,null,null,null,null,null,null,null,null,null,null,null,0,null,null,null,null,null,null,0]
[579,null,null,null,null,null,null,null,null,null,null,null,0,null,null,null,null,null,null,0]
[580,null,null,null,null,null,null,null,null,null,null,null,0,null,null,null,null,null,null,0]
[581,null,null,null,null,null,null,null,null,null,null,null,0,null,null,null,null,null,null,0]
[582,null,null,null,null,null,null,null,null,null,null,null,0,null,null,null,null,null,null,0]
[583,null,null,null,null,null,null,null,null,null,null,null,0,null,null,null,null,null,null,0]
[584,null,null,null,null,null,null,null,null,null,null,null,0,null,null,null,null,null,null,0]
[585,null,null,null,null,null,null,null,null,null,null,null,0,null,null,null,null,null,null,0]
[586,null,null,null,null,null,null,null,null,null,null,null,0,null,null,null,null,null,null,0]
[587,null,null,null,null,null,null,null,null,null,null,null,0,null,null,null,null,null,null,0]
[588,null,null,null,null,null,null,null,null,null,null,null,0,null,null,null,null,null,null,0]
[589,null,null,null,null,null,null,null,null,null,null,null,0,null,null,null,null,null,null,0]
[590,null,null,null,null,null,null,null,null,null,null,null,0,null,null,null,null,null,null,0]
[591,null,null,null,null,null,null,null,null,null,null,null,0,null,null,null,null,null,null,0]
[592,null,null,null,null,null,null,null,null,null,null,null,0,null,null,null,null,null,null,0]
[593,null,null,null,null,null,null,null,null,null,null,null,0,null,null,null,null,null,null,0]
[594,null,null,null,null,null,null,null,null,null,null,null,0,null,null,null,null,null,null,0]
[595,null,null,null,null,null,null,null,null,null,null,null,0,null,null,null,null,null,null,0]
[596,null,null,null,null,null,null,null,null,null,null,null,0,null,null,null,null,null,null,0]
[597,null,null,null,null,null,null,null,null,null,null,null,0,null,null,null,null,null,null,0]
[598,null,null,null,null,null,null,null,null,null,null,null,0,null,null,null,null,null,null,0]
[599,null,null,null,null,null,null,null,null,null,null,null,0,null,null,null,null,null,null,0]
[600,null,null,null,null,null,null,null,null,null,null,null,0,null,null,null,null,null,null,0]
[601,null,null,null,null,null,null,null,null,null,null,null,0,null,null,null,null,null,null,0]
[602,null,null,null,null,null,null,null,null,null,null,null,0,null,null,null,null,null,null,0]
[603,null,null,null,null,null,null,null,null,null,null,null,0,null,null,null,null,null,null,0]
[604,null,null,null,null,null,null,null,null,null,null,null,0,null,null,null,null,null,null,0]
[605,null,null,null,null,null,null,null,null,null,null,null,0,null,null,null,null,null,null,0]
[606,null,null,null,null,null,null,null,null,null,null,null,0,null,null,null,null,null,null,0]
[607,null,null,null,null,null,null,null,null,null,null,null,0,null,null,null,null,null,null,0]
[608,null,null,null,null,null,null,null,null,null,null,null,0,null,null,null,null,null,null,0]
[609,null,null,null,null,null,null,null,null,null,null,null,0,null,null,null,null,null,null,0]
[610,null,null,null,null,null,null,null,null,null,null,null,0,null,null,null,null,null,null,0]
[611,null,null,null,null,null,null,null,null,null,null,null,0,null,null,null,null,null,null,0]
[612,null,null,null,null,null,null,null,null,null,null,null,0,null,null,null,null,null,null,0]
[613,null,null,null,null,null,null,null,null,null,null,null,0,null,null,null,null,null,null,0]
[614,null,null,null,null,null,null,null,null,null,null,null,{"$f":"(G517*$G$2 +H517*$H$2+I517*$I$2+J517*$J$2 +K517*$K$2+L517*$L$2)","v":0},null,null,null,null,null,null,{"$f":"(N517*$N$2 +O517*$O$2+P517*$P$2+Q517*$Q$2 +R517*$R$2+S517*$S$2)","v":0}]
[615,null,null,null,null,null,null,null,null,null,null,null,0,null,null,null,null,null,null,0]
[616,null,null,null,null,null,null,null,null,null,null,null,0,null,null,null,null,null,null,0]
[617,null,null,null,null,null,null,null,null,null,null,null,0,null,null,null,null,null,null,0]
[618,null,null,null,null,null,null,null,null,null,null,null,0,null,null,null,null,null,null,0]
[619,null,null,null,null,null,null,null,null,null,null,null,0,null,null,null,null,null,null,0]
[620,null,null,null,null,null,null,null,null,null,null,null,0,null,null,null,null,null,null,0]
[621,null,null,null,null,null,null,null,null,null,null,null,0,null,null,null,null,null,null,0]
[622,null,null,null,null,null,null,null,null,null,null,null,0,null,null,null,null,null,null,0]
[623,null,null,null,null,null,null,null,null,null,null,null,0,null,null,null,null,null,null,0]
[624,null,null,null,null,null,null,null,null,null,null,null,0,null,null,null,null,null,null,0]
[625,null,null,null,null,null,null,null,null,null,null,null,0,null,null,null,null,null,null,0]
[626,null,null,null,null,null,null,null,null,null,null,null,0,null,null,null,null,null,null,0]
[627,null,null,null,null,null,null,null,null,null,null,null,0,null,null,null,null,null,null,0]
[628,null,null,null,null,null,null,null,null,null,null,null,0,null,null,null,null,null,null,0]
[629,null,null,null,null,null,null,null,null,null,null,null,0,null,null,null,null,null,null,0]
[630,null,null,null,null,null,null,null,null,null,null,null,0,null,null,null,null,null,null,0]
[631,null,null,null,null,null,null,null,null,null,null,null,0,null,null,null,null,null,null,0]
[632,null,null,null,null,null,null,null,null,null,null,null,0,null,null,null,null,null,null,0]
[633,null,null,null,null,null,null,null,null,null,null,null,0,null,null,null,null,null,null,0]
[634,null,null,null,null,null,null,null,null,null,null,null,0,null,null,null,null,null,null,0]
[635,null,null,null,null,null,null,null,null,null,null,null,0,null,null,null,null,null,null,0]
[636,null,null,null,null,null,null,null,null,null,null,null,0,null,null,null,null,null,null,0]
[637,null,null,null,null,null,null,null,null,null,null,null,0,null,null,null,null,null,null,0]
[638,null,null,null,null,null,null,null,null,null,null,null,0,null,null,null,null,null,null,0]
[639,null,null,null,null,null,null,null,null,null,null,null,0,null,null,null,null,null,null,0]
[640,null,null,null,null,null,null,null,null,null,null,null,0,null,null,null,null,null,null,0]
[641,null,null,null,null,null,null,null,null,null,null,null,0,null,null,null,null,null,null,0]
[642,null,null,null,null,null,null,null,null,null,null,null,0,null,null,null,null,null,null,0]
[643,null,null,null,null,null,null,null,null,null,null,null,0,null,null,null,null,null,null,0]
[644,null,null,null,null,null,null,null,null,null,null,null,0,null,null,null,null,null,null,0]
[645,null,null,null,null,null,null,null,null,null,null,null,0,null,null,null,null,null,null,0]
[646,null,null,null,null,null,null,null,null,null,null,null,0,null,null,null,null,null,null,0]
[647,null,null,null,null,null,null,null,null,null,null,null,0,null,null,null,null,null,null,0]
[648,null,null,null,null,null,null,null,null,null,null,null,0,null,null,null,null,null,null,0]
[649,null,null,null,null,null,null,null,null,null,null,null,0,null,null,null,null,null,null,0]
[650,null,null,null,null,null,null,null,null,null,null,null,0,null,null,null,null,null,null,0]
[651,null,null,null,null,null,null,null,null,null,null,null,0,null,null,null,null,null,null,0]
[652,null,null,null,null,null,null,null,null,null,null,null,0,null,null,null,null,null,null,0]
[653,null,null,null,null,null,null,null,null,null,null,null,0,null,null,null,null,null,null,0]
[654,null,null,null,null,null,null,null,null,null,null,null,0,null,null,null,null,null,null,0]
[655,null,null,null,null,null,null,null,null,null,null,null,0,null,null,null,null,null,null,0]
[656,null,null,null,null,null,null,null,null,null,null,null,0,null,null,null,null,null,null,0]
[657,null,null,null,null,null,null,null,null,null,null,null,0,null,null,null,null,null,null,0]
[658,null,null,null,null,null,null,null,null,null,null,null,0,null,null,null,null,null,null,0]
[659,null,null,null,null,null,null,null,null,null,null,null,0,null,null,null,null,null,null,0]
[660,null,null,null,null,null,null,null,null,null,null,null,0,null,null,null,null,null,null,0]
[661,null,null,null,null,null,null,null,null,null,null,null,0,null,null,null,null,null,null,0]
[662,null,null,null,null,null,null,null,null,null,null,null,0,null,null,null,null,null,null,0]
[663,null,null,null,null,null,null,null,null,null,null,null,0,null,null,null,null,null,null,0]
[664,null,null,null,null,null,null,null,null,null,null,null,0,null,null,null,null,null,null,0]
[665,null,null,null,null,null,null,null,null,null,null,null,0,null,null,null,null,null,null,0]
[666,null,null,null,null,null,null,null,null,null,null,null,0,null,null,null,null,null,null,0]
[667,null,null,null,null,null,null,null,null,null,null,null,0,null,null,null,null,null,null,0]
[668,null,null,null,null,null,null,null,null,null,null,null,0,null,null,null,null,null,null,0]
[669,null,null,null,null,null,null,null,null,null,null,null,0,null,null,null,null,null,null,0]
[670,null,null,null,null,null,null,null,null,null,null,null,0,null,null,null,null,null,null,0]
[671,null,null,null,null,null,null,null,null,null,null,null,0,null,null,null,null,null,null,0]
[672,null,null,null,null,null,null,null,null,null,null,null,0,null,null,null,null,null,null,0]
[673,null,null,null,null,null,null,null,null,null,null,null,0,null,null,null,null,null,null,0]
[674,null,null,null,null,null,null,null,null,null,null,null,0,null,null,null,null,null,null,0]
[675,null,null,null,null,null,null,null,null,null,null,null,0,null,null,null,null,null,null,0]
[676,null,null,null,null,null,null,null,null,null,null,null,0,null,null,null,null,null,null,0]
[677,null,null,null,null,null,null,null,null,null,null,null,0,null,null,null,null,null,null,0]
[678,null,null,null,null,null,null,null,null,null,null,null,{"$f":"(G581*$G$2 +H581*$H$2+I581*$I$2+J581*$J$2 +K581*$K$2+L581*$L$2)","v":0},null,null,null,null,null,null,{"$f":"(N581*$N$2 +O581*$O$2+P581*$P$2+Q581*$Q$2 +R581*$R$2+S581*$S$2)","v":0}]
[679,null,null,null,null,null,null,null,null,null,null,null,0,null,null,null,null,null,null,0]
[680,null,null,null,null,null,null,null,null,null,null,null,0,null,null,null,null,null,null,0]
[681,null,null,null,null,null,null,null,null,null,null,null,0,null,null,null,null,null,null,0]
[682,null,null,null,null,null,null,null,null,null,null,null,0,null,null,null,null,null,null,0]
[683,null,null,null,null,null,null,null,null,null,null,null,0,null,null,null,null,null,null,0]
[684,null,null,null,null,null,null,null,null,null,null,null,0,null,null,null,null,null,null,0]
[685,null,null,null,null,null,null,null,null,null,null,null,0,null,null,null,null,null,null,0]
[686,null,null,null,null,null,null,null,null,null,null,null,0,null,null,null,null,null,null,0]
[687,null,null,null,null,null,null,null,null,null,null,null,0,null,null,null,null,null,null,0]
[688,null,null,null,null,null,null,null,null,null,null,null,0,null,null,null,null,null,null,0]
[689,null,null,null,null,null,null,null,null,null,null,null,0,null,null,null,null,null,null,0]
[690,null,null,null,null,null,null,null,null,null,null,null,0,null,null,null,null,null,null,0]
[691,null,null,null,null,null,null,null,null,null,null,null,0,null,null,null,null,null,null,0]
[692,null,null,null,null,null,null,null,null,null,null,null,0,null,null,null,null,null,null,0]
[693,null,null,null,null,null,null,null,null,null,null,null,0,null,null,null,null,null,null,0]
[694,null,null,null,null,null,null,null,null,null,null,null,0,null,null,null,null,null,null,0]
[695,null,null,null,null,null,null,null,null,null,null,null,0,null,null,null,null,null,null,0]
[696,null,null,null,null,null,null,null,null,null,null,null,0,null,null,null,null,null,null,0]
[697,null,null,null,null,null,null,null,null,null,null,null,0,null,null,null,null,null,null,0]
[698,null,null,null,null,null,null,null,null,null,null,null,0,null,null,null,null,null,null,0]
[699,null,null,null,null,null,null,null,null,null,null,null,0,null,null,null,null,null,null,0]
[700,null,null,null,null,null,null,null,null,null,null,null,0,null,null,null,null,null,null,0]
[701,"Open",null,null,null,null,null,null,null,null,null,null,{"$f":"IF($G$2=1,\nIF(H604>1,(ABS(G604-H604)),0)+\nIF(I604>1,(ABS(G604-I604)),0)+\nIF(J604>1,(ABS(G604-J604)),0)+\nIF(K604>1,(ABS(G604-K604)),0)+\nIF(L604>1,(ABS(G604-L604)),0),\n\nIF(I604>1,(ABS(H604-I604)),0)+\nIF(J604>1,(ABS(H604-J604)),0)+\nIF(K604>1,(ABS(H604-K604)),0)+\nIF(L604>1,(ABS(H604-L604)),0) )","v":0},null,null,null,null,null,null,0]
[702,"Open",null,"Neuhaus","Robin","Mettingen",40.700000000000003,41.24,40.96,42,41.13,42.3,4.13,null,null,null,null,null,null,0]
[703,"Open",null,null,null,null,null,null,null,null,null,null,0,null,null,null,null,null,null,0]
[704,"Open",null,null,null,null,null,null,null,null,null,null,0,null,null,null,null,null,null,0]
[705,"Open",null,null,null,null,null,null,null,null,null,null,0,null,null,null,null,null,null,0]
[706,"Open",null,null,null,null,null,null,null,null,null,null,0,null,null,null,null,null,null,0]
[707,"Open",null,null,null,null,null,null,null,null,null,null,0,null,null,null,null,null,null,0]
[708,"Open",null,null,null,null,null,null,null,null,null,null,0,null,null,null,null,null,null,0]
[709,"Open",null,null,null,null,null,null,null,null,null,null,0,null,null,null,null,null,null,0]
[710,"Open",null,null,null,null,null,null,null,null,null,null,0,null,null,null,null,null,null,0]
[711,"Open",null,null,null,null,null,null,null,null,null,null,0,null,null,null,null,null,null,0]
[712,"Open",null,null,null,null,null,null,null,null,null,null,0,null,null,null,null,null,null,0]
[713,"Open",null,null,null,null,null,null,null,null,null,null,0,null,null,null,null,null,null,0]
[714,"Open",null,null,null,null,null,null,null,null,null,null,0,null,null,null,null,null,null,0]
[715,"Open",null,null,null,null,null,null,null,null,null,null,0,null,null,null,null,null,null,0]
[716,"Open",null,null,null,null,null,null,null,null,null,null,0,null,null,null,null,null,null,0]
[717,"Open",null,null,null,null,null,null,null,null,null,null,0,null,null,null,null,null,null,0]
[718,"Open",null,null,null,null,null,null,null,null,null,null,0,null,null,null,null,null,null,0]
[719,"Open",null,null,null,null,null,null,null,null,null,null,0,null,null,null,null,null,null,0]
[720,null,null,null,null,null,null,null,null,null,null,null,0,null,null,null,null,null,null,0]
[721,null,null,null,null,null,null,null,null,null,null,null,0,null,null,null,null,null,null,0]
[722,null,null,null,null,null,null,null,null,null,null,null,0,null,null,null,null,null,null,0]
[723,null,null,null,null,null,null,null,null,null,null,null,0,null,null,null,null,null,null,0]
[724,null,null,null,null,null,null,null,null,null,null,null,0,null,null,null,null,null,null,0]
[725,null,null,null,null,null,null,null,null,null,null,null,0,null,null,null,null,null,null,0]
[726,null,null,null,null,null,null,null,null,null,null,null,0,null,null,null,null,null,null,0]
[727,null,null,null,null,null,null,null,null,null,null,null,0,null,null,null,null,null,null,0]
[728,null,null,null,null,null,null,null,null,null,null,null,0,null,null,null,null,null,null,0]
[729,null,null,null,null,null,null,null,null,null,null,null,0,null,null,null,null,null,null,0]
[730,null,null,null,null,null,null,null,null,null,null,null,0,null,null,null,null,null,null,0]
[731,null,null,null,null,null,null,null,null,null,null,null,0,null,null,null,null,null,null,0]
[732,null,null,null,null,null,null,null,null,null,null,null,0,null,null,null,null,null,null,0]
[733,null,null,null,null,null,null,null,null,null,null,null,0,null,null,null,null,null,null,0]
[734,null,null,null,null,null,null,null,null,null,null,null,0,null,null,null,null,null,null,0]
[735,null,null,null,null,null,null,null,null,null,null,null,0,null,null,null,null,null,null,0]
[736,null,null,null,null,null,null,null,null,null,null,null,0,null,null,null,null,null,null,0]
[737,null,null,null,null,null,null,null,null,null,null,null,0,null,null,null,null,null,null,0]
[738,null,null,null,null,null,null,null,null,null,null,null,0,null,null,null,null,null,null,0]
[739,null,null,null,null,null,null,null,null,null,null,null,0,null,null,null,null,null,null,0]
[740,null,null,null,null,null,null,null,null,null,null,null,0,null,null,null,null,null,null,0]
[741,null,null,null,null,null,null,null,null,null,null,null,0,null,null,null,null,null,null,0]
[742,null,null,null,null,null,null,null,null,null,null,null,0,null,null,null,null,null,null,{"$f":"(N645*$N$2 +O645*$O$2+P645*$P$2+Q645*$Q$2 +R645*$R$2+S645*$S$2)","v":0}]
[743,null,null,null,null,null,null,null,null,null,null,null,0,null,null,null,null,null,null,0]
[744,null,null,null,null,null,null,null,null,null,null,null,0,null,null,null,null,null,null,0]
[745,null,null,null,null,null,null,null,null,null,null,null,0,null,null,null,null,null,null,0]
[746,null,null,null,null,null,null,null,null,null,null,null,0,null,null,null,null,null,null,0]
[747,null,null,null,null,null,null,null,null,null,null,null,0,null,null,null,null,null,null,0]
[748,null,null,null,null,null,null,null,null,null,null,null,0,null,null,null,null,null,null,0]
[749,null,null,null,null,null,null,null,null,null,null,null,0,null,null,null,null,null,null,0]
[750,null,null,null,null,null,null,null,null,null,null,null,0,null,null,null,null,null,null,0]
[751,null,null,null,null,null,null,null,null,null,null,null,0,null,null,null,null,null,null,0]
[752,null,null,null,null,null,null,null,null,null,null,null,0,null,null,null,null,null,null,0]
[753,null,null,null,null,null,null,null,null,null,null,null,0,null,null,null,null,null,null,0]
[754,null,null,null,null,null,null,null,null,null,null,null,0,null,null,null,null,null,null,0]
[755,null,null,null,null,null,null,null,null,null,null,null,0,null,null,null,null,null,null,0]
[756,null,null,null,null,null,null,null,null,null,null,null,0,null,null,null,null,null,null,0]
[757,null,null,null,null,null,null,null,null,null,null,null,0,null,null,null,null,null,null,0]
[758,null,null,null,null,null,null,null,null,null,null,null,0,null,null,null,null,null,null,0]
[759,null,null,null,null,null,null,null,null,null,null,null,0,null,null,null,null,null,null,0]
[760,null,null,null,null,null,null,null,null,null,null,null,0,null,null,null,null,null,null,0]
[761,null,null,null,null,null,null,null,null,null,null,null,0,null,null,null,null,null,null,0]
[762,null,null,null,null,null,null,null,null,null,null,null,0,null,null,null,null,null,null,0]
[763,null,null,null,null,null,null,null,null,null,null,null,0,null,null,null,null,null,null,0]
[764,null,null,null,null,null,null,null,null,null,null,null,0,null,null,null,null,null,null,0]
[765,null,null,null,null,null,null,null,null,null,null,null,{"$f":"IF($G$2=1,\nIF(H668>1,(ABS(G668-H668)),0)+\nIF(I668>1,(ABS(G668-I668)),0)+\nIF(J668>1,(ABS(G668-J668)),0)+\nIF(K668>1,(ABS(G668-K668)),0)+\nIF(L668>1,(ABS(G668-L668)),0),\n\nIF(I668>1,(ABS(H668-I668)),0)+\nIF(J668>1,(ABS(H668-J668)),0)+\nIF(K668>1,(ABS(H668-K668)),0)+\nIF(L668>1,(ABS(H668-L668)),0) )","v":0},null,null,null,null,null,null,0]
[766,null,null,null,null,null,null,null,null,null,null,null,0,null,null,null,null,null,null,0]
[767,null,null,null,null,null,null,null,null,null,null,null,0,null,null,null,null,null,null,0]
[768,null,null,null,null,null,null,null,null,null,null,null,0,null,null,null,null,null,null,0]
[769,null,null,null,null,null,null,null,null,null,null,null,0,null,null,null,null,null,null,0]
[770,null,null,null,null,null,null,null,null,null,null,null,0,null,null,null,null,null,null,0]
[771,null,null,null,null,null,null,null,null,null,null,null,0,null,null,null,null,null,null,0]
[772,null,null,null,null,null,null,null,null,null,null,null,0,null,null,null,null,null,null,0]
[773,null,null,null,null,null,null,null,null,null,null,null,0,null,null,null,null,null,null,0]
[774,null,null,null,null,null,null,null,null,null,null,null,0,null,null,null,null,null,null,0]
[775,null,null,null,null,null,null,null,null,null,null,null,0,null,null,null,null,null,null,0]
[776,null,null,null,null,null,null,null,null,null,null,null,0,null,null,null,null,null,null,0]
[777,null,null,null,null,null,null,null,null,null,null,null,0,null,null,null,null,null,null,0]
[778,null,null,null,null,null,null,null,null,null,null,null,0,null,null,null,null,null,null,0]
[779,null,null,null,null,null,null,null,null,null,null,null,0,null,null,null,null,null,null,0]
[780,null,null,null,null,null,null,null,null,null,null,null,0,null,null,null,null,null,null,0]
[781,null,null,null,null,null,null,null,null,null,null,null,0,null,null,null,null,null,null,0]
[782,null,null,null,null,null,null,null,null,null,null,null,0,null,null,null,null,null,null,0]
[783,null,null,null,null,null,null,null,null,null,null,null,0,null,null,null,null,null,null,0]
[784,null,null,null,null,null,null,null,null,null,null,null,0,null,null,null,null,null,null,0]
[785,null,null,null,null,null,null,null,null,null,null,null,0,null,null,null,null,null,null,0]
[786,null,null,null,null,null,null,null,null,null,null,null,0,null,null,null,null,null,null,0]
[787,null,null,null,null,null,null,null,null,null,null,null,0,null,null,null,null,null,null,0]
[788,null,null,null,null,null,null,null,null,null,null,null,0,null,null,null,null,null,null,0]
[789,null,null,null,null,null,null,null,null,null,null,null,0,null,null,null,null,null,null,0]
[790,null,null,null,null,null,null,null,null,null,null,null,0,null,null,null,null,null,null,0]
[791,null,null,null,null,null,null,null,null,null,null,null,0,null,null,null,null,null,null,0]
[792,null,null,null,null,null,null,null,null,null,null,null,0,null,null,null,null,null,null,0]
[793,null,null,null,null,null,null,null,null,null,null,null,0,null,null,null,null,null,null,0]
[794,null,null,null,null,null,null,null,null,null,null,null,0,null,null,null,null,null,null,0]
[795,null,null,null,null,null,null,null,null,null,null,null,0,null,null,null,null,null,null,0]
[796,null,null,null,null,null,null,null,null,null,null,null,0,null,null,null,null,null,null,0]
[797,null,null,null,null,null,null,null,null,null,null,null,0,null,null,null,null,null,null,0]
[798,null,null,null,null,null,null,null,null,null,null,null,0,null,null,null,null,null,null,0]
[799,null,null,null,null,null,null,null,null,null,null,null,0,null,null,null,null,null,null,0]
[800,null,null,null,null,null,null,null,null,null,null,null,0,null,null,null,null,null,null,0]
[801,"OrtsD",null,null,null,null,null,null,null,null,null,null,0,null,null,null,null,null,null,0]
[802,"OrtsD",null,null,null,null,null,null,null,null,null,null,0,null,null,null,null,null,null,0]
[803,"OrtsD",null,null,null,null,null,null,null,null,null,null,0,null,null,null,null,null,null,0]
[804,"OrtsD",null,null,null,null,null,null,null,null,null,null,0,null,null,null,null,null,null,0]
[805,"OrtsD",null,null,null,null,null,null,null,null,null,null,0,null,null,null,null,null,null,0]
[806,"OrtsD",null,null,null,null,null,null,null,null,null,null,0,null,null,null,null,null,null,{"$f":"(N709*$N$2 +O709*$O$2+P709*$P$2+Q709*$Q$2 +R709*$R$2+S709*$S$2)","v":0}]
[807,"OrtsD",null,null,null,null,null,null,null,null,null,null,0,null,null,null,null,null,null,0]
[808,"OrtsD",null,null,null,null,null,null,null,null,null,null,0,null,null,null,null,null,null,0]
[809,"OrtsD",null,null,null,null,null,null,null,null,null,null,0,null,null,null,null,null,null,0]
[810,"OrtsD",null,null,null,null,null,null,null,null,null,null,0,null,null,null,null,null,null,0]
[811,"OrtsD",null,null,null,null,null,null,null,null,null,null,0,null,null,null,null,null,null,0]
[812,"OrtsD",null,null,null,null,null,null,null,null,null,null,0,null,null,null,null,null,null,0]
[813,"OrtsD",null,null,null,null,null,null,null,null,null,null,0,null,null,null,null,null,null,0]
[814,"OrtsD",null,null,null,null,null,null,null,null,null,null,0,null,null,null,null,null,null,0]
[815,"OrtsD",null,null,null,null,null,null,null,null,null,null,0,null,null,null,null,null,null,0]
[816,"OrtsD",null,null,null,null,null,null,null,null,null,null,0,null,null,null,null,null,null,0]
[817,null,null,null,null,null,null,null,null,null,null,null,0,null,null,null,null,null,null,0]
[818,null,null,null,null,null,null,null,null,null,null,null,0,null,null,null,null,null,null,0]
[819,null,null,null,null,null,null,null,null,null,null,null,0,null,null,null,null,null,null,0]
[820,null,null,null,null,null,null,null,null,null,null,null,0,null,null,null,null,null,null,0]
[821,null,null,null,null,null,null,null,null,null,null,null,0,null,null,null,null,null,null,0]
[822,null,null,null,null,null,null,null,null,null,null,null,0,null,null,null,null,null,null,0]
[823,null,null,null,null,null,null,null,null,null,null,null,0,null,null,null,null,null,null,0]
[824,null,null,null,null,null,null,null,null,null,null,null,0,null,null,null,null,null,null,0]
[825,null,null,null,null,null,null,null,null,null,null,null,0,null,null,null,null,null,null,0]
[826,null,null,null,null,null,null,null,null,null,null,null,0,null,null,null,null,null,null,0]
[827,null,null,null,null,null,null,null,null,null,null,null,0,null,null,null,null,null,null,0]
[828,null,null,null,null,null,null,null,null,null,null,null,0,null,null,null,null,null,null,0]
[829,null,null,null,null,null,null,null,null,null,null,null,{"$f":"IF($G$2=1,\nIF(H732>1,(ABS(G732-H732)),0)+\nIF(I732>1,(ABS(G732-I732)),0)+\nIF(J732>1,(ABS(G732-J732)),0)+\nIF(K732>1,(ABS(G732-K732)),0)+\nIF(L732>1,(ABS(G732-L732)),0),\n\nIF(I732>1,(ABS(H732-I732)),0)+\nIF(J732>1,(ABS(H732-J732)),0)+\nIF(K732>1,(ABS(H732-K732)),0)+\nIF(L732>1,(ABS(H732-L732)),0) )","v":0},null,null,null,null,null,null,0]
[830,null,null,null,null,null,null,null,null,null,null,null,0,null,null,null,null,null,null,0]
[831,null,null,null,null,null,null,null,null,null,null,null,0,null,null,null,null,null,null,0]
[832,null,null,null,null,null,null,null,null,null,null,null,0,null,null,null,null,null,null,0]
[833,null,null,null,null,null,null,null,null,null,null,null,0,null,null,null,null,null,null,0]
[834,null,null,null,null,null,null,null,null,null,null,null,0,null,null,null,null,null,null,0]
[835,null,null,null,null,null,null,null,null,null,null,null,0,null,null,null,null,null,null,0]
[836,null,null,null,null,null,null,null,null,null,null,null,0,null,null,null,null,null,null,0]
[837,null,null,null,null,null,null,null,null,null,null,null,0,null,null,null,null,null,null,0]
[838,null,null,null,null,null,null,null,null,null,null,null,0,null,null,null,null,null,null,0]
[839,null,null,null,null,null,null,null,null,null,null,null,0,null,null,null,null,null,null,0]
[840,null,null,null,null,null,null,null,null,null,null,null,0,null,null,null,null,null,null,0]
[841,null,null,null,null,null,null,null,null,null,null,null,0,null,null,null,null,null,null,0]
[842,null,null,null,null,null,null,null,null,null,null,null,0,null,null,null,null,null,null,0]
[843,null,null,null,null,null,null,null,null,null,null,null,0,null,null,null,null,null,null,0]
[844,null,null,null,null,null,null,null,null,null,null,null,0,null,null,null,null,null,null,0]
[845,null,null,null,null,null,null,null,null,null,null,null,0,null,null,null,null,null,null,0]
[846,null,null,null,null,null,null,null,null,null,null,null,0,null,null,null,null,null,null,0]
[847,null,null,null,null,null,null,null,null,null,null,null,0,null,null,null,null,null,null,0]
[848,null,null,null,null,null,null,null,null,null,null,null,0,null,null,null,null,null,null,0]
[849,null,null,null,null,null,null,null,null,null,null,null,0,null,null,null,null,null,null,0]
[850,null,null,null,null,null,null,null,null,null,null,null,0,null,null,null,null,null,null,0]
[851,null,null,null,null,null,null,null,null,null,null,null,0,null,null,null,null,null,null,0]
[852,null,null,null,null,null,null,null,null,null,null,null,0,null,null,null,null,null,null,0]
[853,null,null,null,null,null,null,null,null,null,null,null,0,null,null,null,null,null,null,0]
[854,null,null,null,null,null,null,null,null,null,null,null,0,null,null,null,null,null,null,0]
[855,null,null,null,null,null,null,null,null,null,null,null,0,null,null,null,null,null,null,0]
[856,null,null,null,null,null,null,null,null,null,null,null,0,null,null,null,null,null,null,0]
[857,null,null,null,null,null,null,null,null,null,null,null,0,null,null,null,null,null,null,0]
[858,null,null,null,null,null,null,null,null,null,null,null,0,null,null,null,null,null,null,0]
[859,null,null,null,null,null,null,null,null,null,null,null,0,null,null,null,null,null,null,0]
[860,null,null,null,null,null,null,null,null,null,null,null,0,null,null,null,null,null,null,0]
[861,null,null,null,null,null,null,null,null,null,null,null,0,null,null,null,null,null,null,0]
[862,null,null,null,null,null,null,null,null,null,null,null,0,null,null,null,null,null,null,0]
[863,null,null,null,null,null,null,null,null,null,null,null,0,null,null,null,null,null,null,0]
[864,null,null,null,null,null,null,null,null,null,null,null,0,null,null,null,null,null,null,0]
[865,null,null,null,null,null,null,null,null,null,null,null,0,null,null,null,null,null,null,0]
[866,null,null,null,null,null,null,null,null,null,null,null,0,null,null,null,null,null,null,0]
[867,null,null,null,null,null,null,null,null,null,null,null,0,null,null,null,null,null,null,0]
[868,null,null,null,null,null,null,null,null,null,null,null,0,null,null,null,null,null,null,0]
[869,null,null,null,null,null,null,null,null,null,null,null,0,null,null,null,null,null,null,0]
[870,null,null,null,null,null,null,null,null,null,null,null,0,null,null,null,null,null,null,{"$f":"(N773*$N$2 +O773*$O$2+P773*$P$2+Q773*$Q$2 +R773*$R$2+S773*$S$2)","v":0}]
[871,null,null,null,null,null,null,null,null,null,null,null,0,null,null,null,null,null,null,0]
[872,null,null,null,null,null,null,null,null,null,null,null,0,null,null,null,null,null,null,0]
[873,null,null,null,null,null,null,null,null,null,null,null,0,null,null,null,null,null,null,0]
[874,null,null,null,null,null,null,null,null,null,null,null,0,null,null,null,null,null,null,0]
[875,null,null,null,null,null,null,null,null,null,null,null,0,null,null,null,null,null,null,0]
[876,null,null,null,null,null,null,null,null,null,null,null,0,null,null,null,null,null,null,0]
[877,null,null,null,null,null,null,null,null,null,null,null,0,null,null,null,null,null,null,0]
[878,null,null,null,null,null,null,null,null,null,null,null,0,null,null,null,null,null,null,0]
[879,null,null,null,null,null,null,null,null,null,null,null,0,null,null,null,null,null,null,0]
[880,null,null,null,null,null,null,null,null,null,null,null,0,null,null,null,null,null,null,0]
[881,null,null,null,null,null,null,null,null,null,null,null,0,null,null,null,null,null,null,0]
[882,null,null,null,null,null,null,null,null,null,null,null,0,null,null,null,null,null,null,0]
[883,null,null,null,null,null,null,null,null,null,null,null,0,null,null,null,null,null,null,0]
[884,null,null,null,null,null,null,null,null,null,null,null,0,null,null,null,null,null,null,0]
[885,null,null,null,null,null,null,null,null,null,null,null,0,null,null,null,null,null,null,0]
[886,null,null,null,null,null,null,null,null,null,null,null,0,null,null,null,null,null,null,0]
[887,null,null,null,null,null,null,null,null,null,null,null,0,null,null,null,null,null,null,0]
[888,null,null,null,null,null,null,null,null,null,null,null,0,null,null,null,null,null,null,0]
[889,null,null,null,null,null,null,null,null,null,null,null,0,null,null,null,null,null,null,0]
[890,null,null,null,null,null,null,null,null,null,null,null,0,null,null,null,null,null,null,0]
[891,null,null,null,null,null,null,null,null,null,null,null,0,null,null,null,null,null,null,0]
[892,null,null,null,null,null,null,null,null,null,null,null,0,null,null,null,null,null,null,0]
[893,null,null,null,null,null,null,null,null,null,null,null,{"$f":"IF($G$2=1,\nIF(H796>1,(ABS(G796-H796)),0)+\nIF(I796>1,(ABS(G796-I796)),0)+\nIF(J796>1,(ABS(G796-J796)),0)+\nIF(K796>1,(ABS(G796-K796)),0)+\nIF(L796>1,(ABS(G796-L796)),0),\n\nIF(I796>1,(ABS(H796-I796)),0)+\nIF(J796>1,(ABS(H796-J796)),0)+\nIF(K796>1,(ABS(H796-K796)),0)+\nIF(L796>1,(ABS(H796-L796)),0) )","v":0},null,null,null,null,null,null,0]
[894,null,null,null,null,null,null,null,null,null,null,null,0,null,null,null,null,null,null,0]
[895,null,null,null,null,null,null,null,null,null,null,null,0,null,null,null,null,null,null,0]
[896,null,null,null,null,null,null,null,null,null,null,null,0,null,null,null,null,null,null,0]
[897,null,null,null,null,null,null,null,null,null,null,null,0,null,null,null,null,null,null,0]
[898,null,null,null,null,null,null,null,null,null,null,null,0,null,null,null,null,null,null,0]
[899,null,null,null,null,null,null,null,null,null,null,null,0,null,null,null,null,null,null,0]
[900,null,null,null,null,null,null,null,null,null,null,null,0,null,null,null,null,null,null,0]
[901,"Open",null,null,null,null,null,null,null,null,null,null,0,null,null,null,null,null,null,{"$f":"IF($N$2=1,\nIF(O804>1,(ABS(N804-O804)),0)+\nIF(P804>1,(ABS(N804-P804)),0)+\nIF(Q804>1,(ABS(N804-Q804)),0)+\nIF(R804>1,(ABS(N804-R804)),0)+\nIF(S804>1,(ABS(N804-S804)),0),\n\nIF(P804>1,(ABS(O804-P804)),0)+\nIF(Q804>1,(ABS(O804-Q804)),0)+\nIF(R804>1,(ABS(O804-R804)),0)+\nIF(S804>1,(ABS(O804-S804)),0) )","v":0}]
[902,"Open",null,null,null,null,null,null,null,null,null,null,0,null,null,null,null,null,null,0]
[903,"Open",null,null,null,null,null,null,null,null,null,null,{"$f":"IF($G$2=1,\nIF(H806>1,(ABS(G806-H806)),0)+\nIF(I806>1,(ABS(G806-I806)),0)+\nIF(J806>1,(ABS(G806-J806)),0)+\nIF(K806>1,(ABS(G806-K806)),0)+\nIF(L806>1,(ABS(G806-L806)),0),\n\nIF(I806>1,(ABS(H806-I806)),0)+\nIF(J806>1,(ABS(H806-J806)),0)+\nIF(K806>1,(ABS(H806-K806)),0)+\nIF(L806>1,(ABS(H806-L806)),0) )","v":0},null,null,null,null,null,null,0]
[904,"Open",null,null,null,null,null,null,null,null,null,null,0,null,null,null,null,null,null,0]
[905,"Open",null,null,null,null,null,null,null,null,null,null,0,null,null,null,null,null,null,0]
[906,"Open",null,null,null,null,null,null,null,null,null,null,0,null,null,null,null,null,null,0]
[907,"Open",null,null,null,null,null,null,null,null,null,null,0,null,null,null,null,null,null,0]
[908,"Open",null,null,null,null,null,null,null,null,null,null,0,null,null,null,null,null,null,0]
[909,"Open",null,null,null,null,null,null,null,null,null,null,0,null,null,null,null,null,null,0]
[910,"Open",null,null,null,null,null,null,null,null,null,null,0,null,null,null,null,null,null,0]
[911,"Open",null,null,null,null,null,null,null,null,null,null,0,null,null,null,null,null,null,0]
[912,"Open",null,null,null,null,null,null,null,null,null,null,0,null,null,null,null,null,null,0]
[913,"Open",null,null,null,null,null,null,null,null,null,null,0,null,null,null,null,null,null,0]
[914,"Open",null,null,null,null,null,null,null,null,null,null,0,null,null,null,null,null,null,0]
[915,"Open",null,null,null,null,null,null,null,null,null,null,0,null,null,null,null,null,null,0]
[916,"Open",null,null,null,null,null,null,null,null,null,null,0,null,null,null,null,null,null,0]
[917,"Open",null,null,null,null,null,null,null,null,null,null,0,null,null,null,null,null,null,0]
[918,"Open",null,null,null,null,null,null,null,null,null,null,0,null,null,null,null,null,null,0]
[919,"Open",null,null,null,null,null,null,null,null,null,null,0,null,null,null,null,null,null,0]
[920,"Open",null,null,null,null,null,null,null,null,null,null,0,null,null,null,null,null,null,0]
[921,"Open",null,null,null,null,null,null,null,null,null,null,0,null,null,null,null,null,null,0]
[922,"Open",null,null,null,null,null,null,null,null,null,null,0,null,null,null,null,null,null,0]
[923,null,null,null,null,null,null,null,null,null,null,null,0,null,null,null,null,null,null,0]
[924,null,null,null,null,null,null,null,null,null,null,null,0,null,null,null,null,null,null,0]
[925,null,null,null,null,null,null,null,null,null,null,null,0,null,null,null,null,null,null,0]
[926,null,null,null,null,null,null,null,null,null,null,null,0,null,null,null,null,null,null,0]
[927,null,null,null,null,null,null,null,null,null,null,null,0,null,null,null,null,null,null,0]
[928,null,null,null,null,null,null,null,null,null,null,null,0,null,null,null,null,null,null,0]
[929,null,null,null,null,null,null,null,null,null,null,null,0,null,null,null,null,null,null,0]
[930,null,null,null,null,null,null,null,null,null,null,null,0,null,null,null,null,null,null,0]
[931,null,null,null,null,null,null,null,null,null,null,null,0,null,null,null,null,null,null,0]
[932,null,null,null,null,null,null,null,null,null,null,null,0,null,null,null,null,null,null,0]
[933,null,null,null,null,null,null,null,null,null,null,null,0,null,null,null,null,null,null,0]
[934,null,null,null,null,null,null,null,null,null,null,null,0,null,null,null,null,null,null,0]
[935,null,null,null,null,null,null,null,null,null,null,null,0,null,null,null,null,null,null,0]
[936,null,null,null,null,null,null,null,null,null,null,null,0,null,null,null,null,null,null,0]
[937,null,null,null,null,null,null,null,null,null,null,null,0,null,null,null,null,null,null,0]
[938,null,null,null,null,null,null,null,null,null,null,null,0,null,null,null,null,null,null,0]
[939,null,null,null,null,null,null,null,null,null,null,null,0,null,null,null,null,null,null,0]
[940,null,null,null,null,null,null,null,null,null,null,null,0,null,null,null,null,null,null,0]
[941,null,null,null,null,null,null,null,null,null,null,null,0,null,null,null,null,null,null,0]
[942,null,null,null,null,null,null,null,null,null,null,null,0,null,null,null,null,null,null,0]
[943,null,null,null,null,null,null,null,null,null,null,null,0,null,null,null,null,null,null,0]
[944,null,null,null,null,null,null,null,null,null,null,null,0,null,null,null,null,null,null,0]
[945,null,null,null,null,null,null,null,null,null,null,null,0,null,null,null,null,null,null,0]
[946,null,null,null,null,null,null,null,null,null,null,null,0,null,null,null,null,null,null,0]
[947,null,null,null,null,null,null,null,null,null,null,null,0,null,null,null,null,null,null,0]
[948,null,null,null,null,null,null,null,null,null,null,null,0,null,null,null,null,null,null,0]
[949,null,null,null,null,null,null,null,null,null,null,null,0,null,null,null,null,null,null,0]
[950,null,null,null,null,null,null,null,null,null,null,null,0,null,null,null,null,null,null,0]
[951,null,null,null,null,null,null,null,null,null,null,null,0,null,null,null,null,null,null,0]
[952,null,null,null,null,null,null,null,null,null,null,null,0,null,null,null,null,null,null,0]
[953,null,null,null,null,null,null,null,null,null,null,null,0,null,null,null,null,null,null,0]
[954,null,null,null,null,null,null,null,null,null,null,null,0,null,null,null,null,null,null,0]
[955,null,null,null,null,null,null,null,null,null,null,null,0,null,null,null,null,null,null,0]
[956,null,null,null,null,null,null,null,null,null,null,null,0,null,null,null,null,null,null,0]
[957,null,null,null,null,null,null,null,null,null,null,null,0,null,null,null,null,null,null,0]
[958,null,null,null,null,null,null,null,null,null,null,null,0,null,null,null,null,null,null,0]
[959,null,null,null,null,null,null,null,null,null,null,null,0,null,null,null,null,null,null,0]
[960,null,null,null,null,null,null,null,null,null,null,null,0,null,null,null,null,null,null,0]
[961,null,null,null,null,null,null,null,null,null,null,null,0,null,null,null,null,null,null,0]
[962,null,null,null,null,null,null,null,null,null,null,null,0,null,null,null,null,null,null,0]
[963,null,null,null,null,null,null,null,null,null,null,null,0,null,null,null,null,null,null,0]
[964,null,null,null,null,null,null,null,null,null,null,null,0,null,null,null,null,null,null,0]
[965,null,null,null,null,null,null,null,null,null,null,null,0,null,null,null,null,null,null,{"$f":"IF($N$2=1,\nIF(O868>1,(ABS(N868-O868)),0)+\nIF(P868>1,(ABS(N868-P868)),0)+\nIF(Q868>1,(ABS(N868-Q868)),0)+\nIF(R868>1,(ABS(N868-R868)),0)+\nIF(S868>1,(ABS(N868-S868)),0),\n\nIF(P868>1,(ABS(O868-P868)),0)+\nIF(Q868>1,(ABS(O868-Q868)),0)+\nIF(R868>1,(ABS(O868-R868)),0)+\nIF(S868>1,(ABS(O868-S868)),0) )","v":0}]
[966,null,null,null,null,null,null,null,null,null,null,null,{"$f":"IF($G$2=1,\nIF(H869>1,(ABS(G869-H869)),0)+\nIF(I869>1,(ABS(G869-I869)),0)+\nIF(J869>1,(ABS(G869-J869)),0)+\nIF(K869>1,(ABS(G869-K869)),0)+\nIF(L869>1,(ABS(G869-L869)),0),\n\nIF(I869>1,(ABS(H869-I869)),0)+\nIF(J869>1,(ABS(H869-J869)),0)+\nIF(K869>1,(ABS(H869-K869)),0)+\nIF(L869>1,(ABS(H869-L869)),0) )","v":0},null,null,null,null,null,null,0]
[967,null,null,null,null,null,null,null,null,null,null,null,0,null,null,null,null,null,null,0]
[968,null,null,null,null,null,null,null,null,null,null,null,0,null,null,null,null,null,null,0]
[969,null,null,null,null,null,null,null,null,null,null,null,0,null,null,null,null,null,null,0]
[970,null,null,null,null,null,null,null,null,null,null,null,0,null,null,null,null,null,null,0]
[971,null,null,null,null,null,null,null,null,null,null,null,0,null,null,null,null,null,null,0]
[972,null,null,null,null,null,null,null,null,null,null,null,0,null,null,null,null,null,null,0]
[973,null,null,null,null,null,null,null,null,null,null,null,0,null,null,null,null,null,null,0]
[974,null,null,null,null,null,null,null,null,null,null,null,0,null,null,null,null,null,null,0]
[975,null,null,null,null,null,null,null,null,null,null,null,0,null,null,null,null,null,null,0]
[976,null,null,null,null,null,null,null,null,null,null,null,0,null,null,null,null,null,null,0]
[977,null,null,null,null,null,null,null,null,null,null,null,0,null,null,null,null,null,null,0]
[978,null,null,null,null,null,null,null,null,null,null,null,0,null,null,null,null,null,null,0]
[979,null,null,null,null,null,null,null,null,null,null,null,0,null,null,null,null,null,null,0]
[980,null,null,null,null,null,null,null,null,null,null,null,0,null,null,null,null,null,null,0]
[981,null,null,null,null,null,null,null,null,null,null,null,0,null,null,null,null,null,null,0]
[982,null,null,null,null,null,null,null,null,null,null,null,0,null,null,null,null,null,null,0]
[983,null,null,null,null,null,null,null,null,null,null,null,0,null,null,null,null,null,null,0]
[984,null,null,null,null,null,null,null,null,null,null,null,0,null,null,null,null,null,null,0]
[985,null,null,null,null,null,null,null,null,null,null,null,0,null,null,null,null,null,null,0]
[986,null,null,null,null,null,null,null,null,null,null,null,0,null,null,null,null,null,null,0]
[987,null,null,null,null,null,null,null,null,null,null,null,0,null,null,null,null,null,null,0]
[988,null,null,null,null,null,null,null,null,null,null,null,0,null,null,null,null,null,null,0]
[989,null,null,null,null,null,null,null,null,null,null,null,0,null,null,null,null,null,null,0]
[990,null,null,null,null,null,null,null,null,null,null,null,0,null,null,null,null,null,null,0]
[991,null,null,null,null,null,null,null,null,null,null,null,0,null,null,null,null,null,null,0]
[992,null,null,null,null,null,null,null,null,null,null,null,0,null,null,null,null,null,null,0]
[993,null,null,null,null,null,null,null,null,null,null,null,0,null,null,null,null,null,null,0]
[994,null,null,null,null,null,null,null,null,null,null,null,0,null,null,null,null,null,null,0]
[995,null,null,null,null,null,null,null,null,null,null,null,0,null,null,null,null,null,null,0]
[996,null,null,null,null,null,null,null,null,null,null,null,0,null,null,null,null,null,null,0]
[997,null,null,null,null,null,null,null,null,null,null,null,0,null,null,null,null,null,null,0]
[998,null,null,null,null,null,null,null,null,null,null,null,0,null,null,null,null,null,null,0]
[999,null,null,"Einzel","! ! !","Start"]

{"sheet":"Ergebnis","index":2,"n_rows":107,"n_cols":16,"rows_kept":107,"cut":false,"hidden":false,"merged":[[2,0,2,11],[4,6,4,11],[3,12,5,14],[0,1,0,12],[1,1,1,12]]}
[null,"09.06.2024    Derby in Mettingen"]
[null,"NRW-Qualifikation Open - Klasse"]
[]
[null,null,null,null,null,null,{"$f":"Gesamt!G2","v":1},{"$f":"Gesamt!H2","v":1},{"$f":"Gesamt!I2","v":1},{"$f":"Gesamt!J2","v":1},{"$f":"Gesamt!K2","v":1},{"$f":"Gesamt!L2","v":1},"Blatt ist\nschreibgeschützt"]
[null,null,null,null,null,null,"Wird der Lauf gewertet?   dann 0 oder 1 "]
[]
["Start\nNummer","Gruppe","NRW","Name","Vorname","Verein","Lauf 1","Lauf 2","Lauf 3","Lauf 4","Lauf 5","Lauf 6","Summe der gewerteten Läufe",null,"Platz","Urkunde"]
[]
[701,{"$f":"LOOKUP(A9,Gesamt!A$4:A$1000,Gesamt!B$4:B$1000)","v":"Open"},{"$f":"LOOKUP(A9,Gesamt!A$4:A$1000,Gesamt!C$4:C$1000)","v":0},{"$f":"LOOKUP(A9,Gesamt!A$4:A$1000,Gesamt!D$4:D$1000)","v":0},{"$f":"LOOKUP(A9,Gesamt!A$4:A$1000,Gesamt!E$4:E$1000)","v":0},{"$f":"LOOKUP(A9,Gesamt!A$4:A$1000,Gesamt!F$4:F$1000)","v":0},{"$f":"LOOKUP(A9,Gesamt!A$4:A$1000,Gesamt!G$4:G$1000)","v":0},{"$f":"LOOKUP(A9,Gesamt!A$4:A$1000,Gesamt!H$4:H$1000)","v":0},{"$f":"LOOKUP(A9,Gesamt!A$4:A$1000,Gesamt!I$4:I$1000)","v":0},{"$f":"LOOKUP(A9,Gesamt!A$4:A$1000,Gesamt!J$4:J$1000)","v":0},{"$f":"LOOKUP(A9,Gesamt!A$4:A$1000,Gesamt!K$4:K$1000)","v":0},{"$f":"LOOKUP(A9,Gesamt!A$4:A$1000,Gesamt!L$4:L$1000)","v":0},{"$f":"LOOKUP(A9,Gesamt!A$4:A$1000,Gesamt!M$4:M$1000)","v":0},{"$f":"IF(M9>0,M9*-1,-1000)","v":-1000},{"$f":"IF(M9>0,RANK(N9,N:N),0)","v":0}]
[702,{"$f":"LOOKUP(A10,Gesamt!A$4:A$1000,Gesamt!B$4:B$1000)","v":"Open"},{"$f":"LOOKUP(A10,Gesamt!A$4:A$1000,Gesamt!C$4:C$1000)","v":0},{"$f":"LOOKUP(A10,Gesamt!A$4:A$1000,Gesamt!D$4:D$1000)","v":"Neuhaus"},{"$f":"LOOKUP(A10,Gesamt!A$4:A$1000,Gesamt!E$4:E$1000)","v":"Robin"},{"$f":"LOOKUP(A10,Gesamt!A$4:A$1000,Gesamt!F$4:F$1000)","v":"Mettingen"},{"$f":"LOOKUP(A10,Gesamt!A$4:A$1000,Gesamt!G$4:G$1000)","v":40.700000000000003},{"$f":"LOOKUP(A10,Gesamt!A$4:A$1000,Gesamt!H$4:H$1000)","v":41.24},{"$f":"LOOKUP(A10,Gesamt!A$4:A$1000,Gesamt!I$4:I$1000)","v":40.96},{"$f":"LOOKUP(A10,Gesamt!A$4:A$1000,Gesamt!J$4:J$1000)","v":42},{"$f":"LOOKUP(A10,Gesamt!A$4:A$1000,Gesamt!K$4:K$1000)","v":41.13},{"$f":"LOOKUP(A10,Gesamt!A$4:A$1000,Gesamt!L$4:L$1000)","v":42.3},{"$f":"LOOKUP(A10,Gesamt!A$4:A$1000,Gesamt!M$4:M$1000)","v":4.13},{"$f":"IF(M10>0,M10*-1,-1000)","v":-4.13},{"$f":"IF(M10>0,RANK(N10,N:N),0)","v":1}]
[703,{"$f":"LOOKUP(A11,Gesamt!A$4:A$1000,Gesamt!B$4:B$1000)","v":"Open"},{"$f":"LOOKUP(A11,Gesamt!A$4:A$1000,Gesamt!C$4:C$1000)","v":0},{"$f":"LOOKUP(A11,Gesamt!A$4:A$1000,Gesamt!D$4:D$1000)","v":0},{"$f":"LOOKUP(A11,Gesamt!A$4:A$1000,Gesamt!E$4:E$1000)","v":0},{"$f":"LOOKUP(A11,Gesamt!A$4:A$1000,Gesamt!F$4:F$1000)","v":0},{"$f":"LOOKUP(A11,Gesamt!A$4:A$1000,Gesamt!G$4:G$1000)","v":0},{"$f":"LOOKUP(A11,Gesamt!A$4:A$1000,Gesamt!H$4:H$1000)","v":0},{"$f":"LOOKUP(A11,Gesamt!A$4:A$1000,Gesamt!I$4:I$1000)","v":0},{"$f":"LOOKUP(A11,Gesamt!A$4:A$1000,Gesamt!J$4:J$1000)","v":0},{"$f":"LOOKUP(A11,Gesamt!A$4:A$1000,Gesamt!K$4:K$1000)","v":0},{"$f":"LOOKUP(A11,Gesamt!A$4:A$1000,Gesamt!L$4:L$1000)","v":0},{"$f":"LOOKUP(A11,Gesamt!A$4:A$1000,Gesamt!M$4:M$1000)","v":0},{"$f":"IF(M11>0,M11*-1,-1000)","v":-1000},{"$f":"IF(M11>0,RANK(N11,N:N),0)","v":0}]
[704,{"$f":"LOOKUP(A12,Gesamt!A$4:A$1000,Gesamt!B$4:B$1000)","v":"Open"},{"$f":"LOOKUP(A12,Gesamt!A$4:A$1000,Gesamt!C$4:C$1000)","v":0},{"$f":"LOOKUP(A12,Gesamt!A$4:A$1000,Gesamt!D$4:D$1000)","v":0},{"$f":"LOOKUP(A12,Gesamt!A$4:A$1000,Gesamt!E$4:E$1000)","v":0},{"$f":"LOOKUP(A12,Gesamt!A$4:A$1000,Gesamt!F$4:F$1000)","v":0},{"$f":"LOOKUP(A12,Gesamt!A$4:A$1000,Gesamt!G$4:G$1000)","v":0},{"$f":"LOOKUP(A12,Gesamt!A$4:A$1000,Gesamt!H$4:H$1000)","v":0},{"$f":"LOOKUP(A12,Gesamt!A$4:A$1000,Gesamt!I$4:I$1000)","v":0},{"$f":"LOOKUP(A12,Gesamt!A$4:A$1000,Gesamt!J$4:J$1000)","v":0},{"$f":"LOOKUP(A12,Gesamt!A$4:A$1000,Gesamt!K$4:K$1000)","v":0},{"$f":"LOOKUP(A12,Gesamt!A$4:A$1000,Gesamt!L$4:L$1000)","v":0},{"$f":"LOOKUP(A12,Gesamt!A$4:A$1000,Gesamt!M$4:M$1000)","v":0},{"$f":"IF(M12>0,M12*-1,-1000)","v":-1000},{"$f":"IF(M12>0,RANK(N12,N:N),0)","v":0}]
[705,{"$f":"LOOKUP(A13,Gesamt!A$4:A$1000,Gesamt!B$4:B$1000)","v":"Open"},{"$f":"LOOKUP(A13,Gesamt!A$4:A$1000,Gesamt!C$4:C$1000)","v":0},{"$f":"LOOKUP(A13,Gesamt!A$4:A$1000,Gesamt!D$4:D$1000)","v":0},{"$f":"LOOKUP(A13,Gesamt!A$4:A$1000,Gesamt!E$4:E$1000)","v":0},{"$f":"LOOKUP(A13,Gesamt!A$4:A$1000,Gesamt!F$4:F$1000)","v":0},{"$f":"LOOKUP(A13,Gesamt!A$4:A$1000,Gesamt!G$4:G$1000)","v":0},{"$f":"LOOKUP(A13,Gesamt!A$4:A$1000,Gesamt!H$4:H$1000)","v":0},{"$f":"LOOKUP(A13,Gesamt!A$4:A$1000,Gesamt!I$4:I$1000)","v":0},{"$f":"LOOKUP(A13,Gesamt!A$4:A$1000,Gesamt!J$4:J$1000)","v":0},{"$f":"LOOKUP(A13,Gesamt!A$4:A$1000,Gesamt!K$4:K$1000)","v":0},{"$f":"LOOKUP(A13,Gesamt!A$4:A$1000,Gesamt!L$4:L$1000)","v":0},{"$f":"LOOKUP(A13,Gesamt!A$4:A$1000,Gesamt!M$4:M$1000)","v":0},{"$f":"IF(M13>0,M13*-1,-1000)","v":-1000},{"$f":"IF(M13>0,RANK(N13,N:N),0)","v":0}]
[706,{"$f":"LOOKUP(A14,Gesamt!A$4:A$1000,Gesamt!B$4:B$1000)","v":"Open"},{"$f":"LOOKUP(A14,Gesamt!A$4:A$1000,Gesamt!C$4:C$1000)","v":0},{"$f":"LOOKUP(A14,Gesamt!A$4:A$1000,Gesamt!D$4:D$1000)","v":0},{"$f":"LOOKUP(A14,Gesamt!A$4:A$1000,Gesamt!E$4:E$1000)","v":0},{"$f":"LOOKUP(A14,Gesamt!A$4:A$1000,Gesamt!F$4:F$1000)","v":0},{"$f":"LOOKUP(A14,Gesamt!A$4:A$1000,Gesamt!G$4:G$1000)","v":0},{"$f":"LOOKUP(A14,Gesamt!A$4:A$1000,Gesamt!H$4:H$1000)","v":0},{"$f":"LOOKUP(A14,Gesamt!A$4:A$1000,Gesamt!I$4:I$1000)","v":0},{"$f":"LOOKUP(A14,Gesamt!A$4:A$1000,Gesamt!J$4:J$1000)","v":0},{"$f":"LOOKUP(A14,Gesamt!A$4:A$1000,Gesamt!K$4:K$1000)","v":0},{"$f":"LOOKUP(A14,Gesamt!A$4:A$1000,Gesamt!L$4:L$1000)","v":0},{"$f":"LOOKUP(A14,Gesamt!A$4:A$1000,Gesamt!M$4:M$1000)","v":0},{"$f":"IF(M14>0,M14*-1,-1000)","v":-1000},{"$f":"IF(M14>0,RANK(N14,N:N),0)","v":0}]
[707,{"$f":"LOOKUP(A15,Gesamt!A$4:A$1000,Gesamt!B$4:B$1000)","v":"Open"},{"$f":"LOOKUP(A15,Gesamt!A$4:A$1000,Gesamt!C$4:C$1000)","v":0},{"$f":"LOOKUP(A15,Gesamt!A$4:A$1000,Gesamt!D$4:D$1000)","v":0},{"$f":"LOOKUP(A15,Gesamt!A$4:A$1000,Gesamt!E$4:E$1000)","v":0},{"$f":"LOOKUP(A15,Gesamt!A$4:A$1000,Gesamt!F$4:F$1000)","v":0},{"$f":"LOOKUP(A15,Gesamt!A$4:A$1000,Gesamt!G$4:G$1000)","v":0},{"$f":"LOOKUP(A15,Gesamt!A$4:A$1000,Gesamt!H$4:H$1000)","v":0},{"$f":"LOOKUP(A15,Gesamt!A$4:A$1000,Gesamt!I$4:I$1000)","v":0},{"$f":"LOOKUP(A15,Gesamt!A$4:A$1000,Gesamt!J$4:J$1000)","v":0},{"$f":"LOOKUP(A15,Gesamt!A$4:A$1000,Gesamt!K$4:K$1000)","v":0},{"$f":"LOOKUP(A15,Gesamt!A$4:A$1000,Gesamt!L$4:L$1000)","v":0},{"$f":"LOOKUP(A15,Gesamt!A$4:A$1000,Gesamt!M$4:M$1000)","v":0},{"$f":"IF(M15>0,M15*-1,-1000)","v":-1000},{"$f":"IF(M15>0,RANK(N15,N:N),0)","v":0}]
[708,{"$f":"LOOKUP(A16,Gesamt!A$4:A$1000,Gesamt!B$4:B$1000)","v":"Open"},{"$f":"LOOKUP(A16,Gesamt!A$4:A$1000,Gesamt!C$4:C$1000)","v":0},{"$f":"LOOKUP(A16,Gesamt!A$4:A$1000,Gesamt!D$4:D$1000)","v":0},{"$f":"LOOKUP(A16,Gesamt!A$4:A$1000,Gesamt!E$4:E$1000)","v":0},{"$f":"LOOKUP(A16,Gesamt!A$4:A$1000,Gesamt!F$4:F$1000)","v":0},{"$f":"LOOKUP(A16,Gesamt!A$4:A$1000,Gesamt!G$4:G$1000)","v":0},{"$f":"LOOKUP(A16,Gesamt!A$4:A$1000,Gesamt!H$4:H$1000)","v":0},{"$f":"LOOKUP(A16,Gesamt!A$4:A$1000,Gesamt!I$4:I$1000)","v":0},{"$f":"LOOKUP(A16,Gesamt!A$4:A$1000,Gesamt!J$4:J$1000)","v":0},{"$f":"LOOKUP(A16,Gesamt!A$4:A$1000,Gesamt!K$4:K$1000)","v":0},{"$f":"LOOKUP(A16,Gesamt!A$4:A$1000,Gesamt!L$4:L$1000)","v":0},{"$f":"LOOKUP(A16,Gesamt!A$4:A$1000,Gesamt!M$4:M$1000)","v":0},{"$f":"IF(M16>0,M16*-1,-1000)","v":-1000},{"$f":"IF(M16>0,RANK(N16,N:N),0)","v":0}]
[709,{"$f":"LOOKUP(A17,Gesamt!A$4:A$1000,Gesamt!B$4:B$1000)","v":"Open"},{"$f":"LOOKUP(A17,Gesamt!A$4:A$1000,Gesamt!C$4:C$1000)","v":0},{"$f":"LOOKUP(A17,Gesamt!A$4:A$1000,Gesamt!D$4:D$1000)","v":0},{"$f":"LOOKUP(A17,Gesamt!A$4:A$1000,Gesamt!E$4:E$1000)","v":0},{"$f":"LOOKUP(A17,Gesamt!A$4:A$1000,Gesamt!F$4:F$1000)","v":0},{"$f":"LOOKUP(A17,Gesamt!A$4:A$1000,Gesamt!G$4:G$1000)","v":0},{"$f":"LOOKUP(A17,Gesamt!A$4:A$1000,Gesamt!H$4:H$1000)","v":0},{"$f":"LOOKUP(A17,Gesamt!A$4:A$1000,Gesamt!I$4:I$1000)","v":0},{"$f":"LOOKUP(A17,Gesamt!A$4:A$1000,Gesamt!J$4:J$1000)","v":0},{"$f":"LOOKUP(A17,Gesamt!A$4:A$1000,Gesamt!K$4:K$1000)","v":0},{"$f":"LOOKUP(A17,Gesamt!A$4:A$1000,Gesamt!L$4:L$1000)","v":0},{"$f":"LOOKUP(A17,Gesamt!A$4:A$1000,Gesamt!M$4:M$1000)","v":0},{"$f":"IF(M17>0,M17*-1,-1000)","v":-1000},{"$f":"IF(M17>0,RANK(N17,N:N),0)","v":0}]
[710,{"$f":"LOOKUP(A18,Gesamt!A$4:A$1000,Gesamt!B$4:B$1000)","v":"Open"},{"$f":"LOOKUP(A18,Gesamt!A$4:A$1000,Gesamt!C$4:C$1000)","v":0},{"$f":"LOOKUP(A18,Gesamt!A$4:A$1000,Gesamt!D$4:D$1000)","v":0},{"$f":"LOOKUP(A18,Gesamt!A$4:A$1000,Gesamt!E$4:E$1000)","v":0},{"$f":"LOOKUP(A18,Gesamt!A$4:A$1000,Gesamt!F$4:F$1000)","v":0},{"$f":"LOOKUP(A18,Gesamt!A$4:A$1000,Gesamt!G$4:G$1000)","v":0},{"$f":"LOOKUP(A18,Gesamt!A$4:A$1000,Gesamt!H$4:H$1000)","v":0},{"$f":"LOOKUP(A18,Gesamt!A$4:A$1000,Gesamt!I$4:I$1000)","v":0},{"$f":"LOOKUP(A18,Gesamt!A$4:A$1000,Gesamt!J$4:J$1000)","v":0},{"$f":"LOOKUP(A18,Gesamt!A$4:A$1000,Gesamt!K$4:K$1000)","v":0},{"$f":"LOOKUP(A18,Gesamt!A$4:A$1000,Gesamt!L$4:L$1000)","v":0},{"$f":"LOOKUP(A18,Gesamt!A$4:A$1000,Gesamt!M$4:M$1000)","v":0},{"$f":"IF(M18>0,M18*-1,-1000)","v":-1000},{"$f":"IF(M18>0,RANK(N18,N:N),0)","v":0}]
[711,{"$f":"LOOKUP(A19,Gesamt!A$4:A$1000,Gesamt!B$4:B$1000)","v":"Open"},{"$f":"LOOKUP(A19,Gesamt!A$4:A$1000,Gesamt!C$4:C$1000)","v":0},{"$f":"LOOKUP(A19,Gesamt!A$4:A$1000,Gesamt!D$4:D$1000)","v":0},{"$f":"LOOKUP(A19,Gesamt!A$4:A$1000,Gesamt!E$4:E$1000)","v":0},{"$f":"LOOKUP(A19,Gesamt!A$4:A$1000,Gesamt!F$4:F$1000)","v":0},{"$f":"LOOKUP(A19,Gesamt!A$4:A$1000,Gesamt!G$4:G$1000)","v":0},{"$f":"LOOKUP(A19,Gesamt!A$4:A$1000,Gesamt!H$4:H$1000)","v":0},{"$f":"LOOKUP(A19,Gesamt!A$4:A$1000,Gesamt!I$4:I$1000)","v":0},{"$f":"LOOKUP(A19,Gesamt!A$4:A$1000,Gesamt!J$4:J$1000)","v":0},{"$f":"LOOKUP(A19,Gesamt!A$4:A$1000,Gesamt!K$4:K$1000)","v":0},{"$f":"LOOKUP(A19,Gesamt!A$4:A$1000,Gesamt!L$4:L$1000)","v":0},{"$f":"LOOKUP(A19,Gesamt!A$4:A$1000,Gesamt!M$4:M$1000)","v":0},{"$f":"IF(M19>0,M19*-1,-1000)","v":-1000},{"$f":"IF(M19>0,RANK(N19,N:N),0)","v":0}]
[712,{"$f":"LOOKUP(A20,Gesamt!A$4:A$1000,Gesamt!B$4:B$1000)","v":"Open"},{"$f":"LOOKUP(A20,Gesamt!A$4:A$1000,Gesamt!C$4:C$1000)","v":0},{"$f":"LOOKUP(A20,Gesamt!A$4:A$1000,Gesamt!D$4:D$1000)","v":0},{"$f":"LOOKUP(A20,Gesamt!A$4:A$1000,Gesamt!E$4:E$1000)","v":0},{"$f":"LOOKUP(A20,Gesamt!A$4:A$1000,Gesamt!F$4:F$1000)","v":0},{"$f":"LOOKUP(A20,Gesamt!A$4:A$1000,Gesamt!G$4:G$1000)","v":0},{"$f":"LOOKUP(A20,Gesamt!A$4:A$1000,Gesamt!H$4:H$1000)","v":0},{"$f":"LOOKUP(A20,Gesamt!A$4:A$1000,Gesamt!I$4:I$1000)","v":0},{"$f":"LOOKUP(A20,Gesamt!A$4:A$1000,Gesamt!J$4:J$1000)","v":0},{"$f":"LOOKUP(A20,Gesamt!A$4:A$1000,Gesamt!K$4:K$1000)","v":0},{"$f":"LOOKUP(A20,Gesamt!A$4:A$1000,Gesamt!L$4:L$1000)","v":0},{"$f":"LOOKUP(A20,Gesamt!A$4:A$1000,Gesamt!M$4:M$1000)","v":0},{"$f":"IF(M20>0,M20*-1,-1000)","v":-1000},{"$f":"IF(M20>0,RANK(N20,N:N),0)","v":0}]
[713,{"$f":"LOOKUP(A21,Gesamt!A$4:A$1000,Gesamt!B$4:B$1000)","v":"Open"},{"$f":"LOOKUP(A21,Gesamt!A$4:A$1000,Gesamt!C$4:C$1000)","v":0},{"$f":"LOOKUP(A21,Gesamt!A$4:A$1000,Gesamt!D$4:D$1000)","v":0},{"$f":"LOOKUP(A21,Gesamt!A$4:A$1000,Gesamt!E$4:E$1000)","v":0},{"$f":"LOOKUP(A21,Gesamt!A$4:A$1000,Gesamt!F$4:F$1000)","v":0},{"$f":"LOOKUP(A21,Gesamt!A$4:A$1000,Gesamt!G$4:G$1000)","v":0},{"$f":"LOOKUP(A21,Gesamt!A$4:A$1000,Gesamt!H$4:H$1000)","v":0},{"$f":"LOOKUP(A21,Gesamt!A$4:A$1000,Gesamt!I$4:I$1000)","v":0},{"$f":"LOOKUP(A21,Gesamt!A$4:A$1000,Gesamt!J$4:J$1000)","v":0},{"$f":"LOOKUP(A21,Gesamt!A$4:A$1000,Gesamt!K$4:K$1000)","v":0},{"$f":"LOOKUP(A21,Gesamt!A$4:A$1000,Gesamt!L$4:L$1000)","v":0},{"$f":"LOOKUP(A21,Gesamt!A$4:A$1000,Gesamt!M$4:M$1000)","v":0},{"$f":"IF(M21>0,M21*-1,-1000)","v":-1000},{"$f":"IF(M21>0,RANK(N21,N:N),0)","v":0}]
[714,{"$f":"LOOKUP(A22,Gesamt!A$4:A$1000,Gesamt!B$4:B$1000)","v":"Open"},{"$f":"LOOKUP(A22,Gesamt!A$4:A$1000,Gesamt!C$4:C$1000)","v":0},{"$f":"LOOKUP(A22,Gesamt!A$4:A$1000,Gesamt!D$4:D$1000)","v":0},{"$f":"LOOKUP(A22,Gesamt!A$4:A$1000,Gesamt!E$4:E$1000)","v":0},{"$f":"LOOKUP(A22,Gesamt!A$4:A$1000,Gesamt!F$4:F$1000)","v":0},{"$f":"LOOKUP(A22,Gesamt!A$4:A$1000,Gesamt!G$4:G$1000)","v":0},{"$f":"LOOKUP(A22,Gesamt!A$4:A$1000,Gesamt!H$4:H$1000)","v":0},{"$f":"LOOKUP(A22,Gesamt!A$4:A$1000,Gesamt!I$4:I$1000)","v":0},{"$f":"LOOKUP(A22,Gesamt!A$4:A$1000,Gesamt!J$4:J$1000)","v":0},{"$f":"LOOKUP(A22,Gesamt!A$4:A$1000,Gesamt!K$4:K$1000)","v":0},{"$f":"LOOKUP(A22,Gesamt!A$4:A$1000,Gesamt!L$4:L$1000)","v":0},{"$f":"LOOKUP(A22,Gesamt!A$4:A$1000,Gesamt!M$4:M$1000)","v":0},{"$f":"IF(M22>0,M22*-1,-1000)","v":-1000},{"$f":"IF(M22>0,RANK(N22,N:N),0)","v":0}]
[715,{"$f":"LOOKUP(A23,Gesamt!A$4:A$1000,Gesamt!B$4:B$1000)","v":"Open"},{"$f":"LOOKUP(A23,Gesamt!A$4:A$1000,Gesamt!C$4:C$1000)","v":0},{"$f":"LOOKUP(A23,Gesamt!A$4:A$1000,Gesamt!D$4:D$1000)","v":0},{"$f":"LOOKUP(A23,Gesamt!A$4:A$1000,Gesamt!E$4:E$1000)","v":0},{"$f":"LOOKUP(A23,Gesamt!A$4:A$1000,Gesamt!F$4:F$1000)","v":0},{"$f":"LOOKUP(A23,Gesamt!A$4:A$1000,Gesamt!G$4:G$1000)","v":0},{"$f":"LOOKUP(A23,Gesamt!A$4:A$1000,Gesamt!H$4:H$1000)","v":0},{"$f":"LOOKUP(A23,Gesamt!A$4:A$1000,Gesamt!I$4:I$1000)","v":0},{"$f":"LOOKUP(A23,Gesamt!A$4:A$1000,Gesamt!J$4:J$1000)","v":0},{"$f":"LOOKUP(A23,Gesamt!A$4:A$1000,Gesamt!K$4:K$1000)","v":0},{"$f":"LOOKUP(A23,Gesamt!A$4:A$1000,Gesamt!L$4:L$1000)","v":0},{"$f":"LOOKUP(A23,Gesamt!A$4:A$1000,Gesamt!M$4:M$1000)","v":0},{"$f":"IF(M23>0,M23*-1,-1000)","v":-1000},{"$f":"IF(M23>0,RANK(N23,N:N),0)","v":0}]
[716,{"$f":"LOOKUP(A24,Gesamt!A$4:A$1000,Gesamt!B$4:B$1000)","v":"Open"},{"$f":"LOOKUP(A24,Gesamt!A$4:A$1000,Gesamt!C$4:C$1000)","v":0},{"$f":"LOOKUP(A24,Gesamt!A$4:A$1000,Gesamt!D$4:D$1000)","v":0},{"$f":"LOOKUP(A24,Gesamt!A$4:A$1000,Gesamt!E$4:E$1000)","v":0},{"$f":"LOOKUP(A24,Gesamt!A$4:A$1000,Gesamt!F$4:F$1000)","v":0},{"$f":"LOOKUP(A24,Gesamt!A$4:A$1000,Gesamt!G$4:G$1000)","v":0},{"$f":"LOOKUP(A24,Gesamt!A$4:A$1000,Gesamt!H$4:H$1000)","v":0},{"$f":"LOOKUP(A24,Gesamt!A$4:A$1000,Gesamt!I$4:I$1000)","v":0},{"$f":"LOOKUP(A24,Gesamt!A$4:A$1000,Gesamt!J$4:J$1000)","v":0},{"$f":"LOOKUP(A24,Gesamt!A$4:A$1000,Gesamt!K$4:K$1000)","v":0},{"$f":"LOOKUP(A24,Gesamt!A$4:A$1000,Gesamt!L$4:L$1000)","v":0},{"$f":"LOOKUP(A24,Gesamt!A$4:A$1000,Gesamt!M$4:M$1000)","v":0},{"$f":"IF(M24>0,M24*-1,-1000)","v":-1000},{"$f":"IF(M24>0,RANK(N24,N:N),0)","v":0}]
[717,{"$f":"LOOKUP(A25,Gesamt!A$4:A$1000,Gesamt!B$4:B$1000)","v":"Open"},{"$f":"LOOKUP(A25,Gesamt!A$4:A$1000,Gesamt!C$4:C$1000)","v":0},{"$f":"LOOKUP(A25,Gesamt!A$4:A$1000,Gesamt!D$4:D$1000)","v":0},{"$f":"LOOKUP(A25,Gesamt!A$4:A$1000,Gesamt!E$4:E$1000)","v":0},{"$f":"LOOKUP(A25,Gesamt!A$4:A$1000,Gesamt!F$4:F$1000)","v":0},{"$f":"LOOKUP(A25,Gesamt!A$4:A$1000,Gesamt!G$4:G$1000)","v":0},{"$f":"LOOKUP(A25,Gesamt!A$4:A$1000,Gesamt!H$4:H$1000)","v":0},{"$f":"LOOKUP(A25,Gesamt!A$4:A$1000,Gesamt!I$4:I$1000)","v":0},{"$f":"LOOKUP(A25,Gesamt!A$4:A$1000,Gesamt!J$4:J$1000)","v":0},{"$f":"LOOKUP(A25,Gesamt!A$4:A$1000,Gesamt!K$4:K$1000)","v":0},{"$f":"LOOKUP(A25,Gesamt!A$4:A$1000,Gesamt!L$4:L$1000)","v":0},{"$f":"LOOKUP(A25,Gesamt!A$4:A$1000,Gesamt!M$4:M$1000)","v":0},{"$f":"IF(M25>0,M25*-1,-1000)","v":-1000},{"$f":"IF(M25>0,RANK(N25,N:N),0)","v":0}]
[718,{"$f":"LOOKUP(A26,Gesamt!A$4:A$1000,Gesamt!B$4:B$1000)","v":"Open"},{"$f":"LOOKUP(A26,Gesamt!A$4:A$1000,Gesamt!C$4:C$1000)","v":0},{"$f":"LOOKUP(A26,Gesamt!A$4:A$1000,Gesamt!D$4:D$1000)","v":0},{"$f":"LOOKUP(A26,Gesamt!A$4:A$1000,Gesamt!E$4:E$1000)","v":0},{"$f":"LOOKUP(A26,Gesamt!A$4:A$1000,Gesamt!F$4:F$1000)","v":0},{"$f":"LOOKUP(A26,Gesamt!A$4:A$1000,Gesamt!G$4:G$1000)","v":0},{"$f":"LOOKUP(A26,Gesamt!A$4:A$1000,Gesamt!H$4:H$1000)","v":0},{"$f":"LOOKUP(A26,Gesamt!A$4:A$1000,Gesamt!I$4:I$1000)","v":0},{"$f":"LOOKUP(A26,Gesamt!A$4:A$1000,Gesamt!J$4:J$1000)","v":0},{"$f":"LOOKUP(A26,Gesamt!A$4:A$1000,Gesamt!K$4:K$1000)","v":0},{"$f":"LOOKUP(A26,Gesamt!A$4:A$1000,Gesamt!L$4:L$1000)","v":0},{"$f":"LOOKUP(A26,Gesamt!A$4:A$1000,Gesamt!M$4:M$1000)","v":0},{"$f":"IF(M26>0,M26*-1,-1000)","v":-1000},{"$f":"IF(M26>0,RANK(N26,N:N),0)","v":0}]
[719,{"$f":"LOOKUP(A27,Gesamt!A$4:A$1000,Gesamt!B$4:B$1000)","v":"Open"},{"$f":"LOOKUP(A27,Gesamt!A$4:A$1000,Gesamt!C$4:C$1000)","v":0},{"$f":"LOOKUP(A27,Gesamt!A$4:A$1000,Gesamt!D$4:D$1000)","v":0},{"$f":"LOOKUP(A27,Gesamt!A$4:A$1000,Gesamt!E$4:E$1000)","v":0},{"$f":"LOOKUP(A27,Gesamt!A$4:A$1000,Gesamt!F$4:F$1000)","v":0},{"$f":"LOOKUP(A27,Gesamt!A$4:A$1000,Gesamt!G$4:G$1000)","v":0},{"$f":"LOOKUP(A27,Gesamt!A$4:A$1000,Gesamt!H$4:H$1000)","v":0},{"$f":"LOOKUP(A27,Gesamt!A$4:A$1000,Gesamt!I$4:I$1000)","v":0},{"$f":"LOOKUP(A27,Gesamt!A$4:A$1000,Gesamt!J$4:J$1000)","v":0},{"$f":"LOOKUP(A27,Gesamt!A$4:A$1000,Gesamt!K$4:K$1000)","v":0},{"$f":"LOOKUP(A27,Gesamt!A$4:A$1000,Gesamt!L$4:L$1000)","v":0},{"$f":"LOOKUP(A27,Gesamt!A$4:A$1000,Gesamt!M$4:M$1000)","v":0},{"$f":"IF(M27>0,M27*-1,-1000)","v":-1000},{"$f":"IF(M27>0,RANK(N27,N:N),0)","v":0}]
[720,{"$f":"LOOKUP(A28,Gesamt!A$4:A$1000,Gesamt!B$4:B$1000)","v":0},{"$f":"LOOKUP(A28,Gesamt!A$4:A$1000,Gesamt!C$4:C$1000)","v":0},{"$f":"LOOKUP(A28,Gesamt!A$4:A$1000,Gesamt!D$4:D$1000)","v":0},{"$f":"LOOKUP(A28,Gesamt!A$4:A$1000,Gesamt!E$4:E$1000)","v":0},{"$f":"LOOKUP(A28,Gesamt!A$4:A$1000,Gesamt!F$4:F$1000)","v":0},{"$f":"LOOKUP(A28,Gesamt!A$4:A$1000,Gesamt!G$4:G$1000)","v":0},{"$f":"LOOKUP(A28,Gesamt!A$4:A$1000,Gesamt!H$4:H$1000)","v":0},{"$f":"LOOKUP(A28,Gesamt!A$4:A$1000,Gesamt!I$4:I$1000)","v":0},{"$f":"LOOKUP(A28,Gesamt!A$4:A$1000,Gesamt!J$4:J$1000)","v":0},{"$f":"LOOKUP(A28,Gesamt!A$4:A$1000,Gesamt!K$4:K$1000)","v":0},{"$f":"LOOKUP(A28,Gesamt!A$4:A$1000,Gesamt!L$4:L$1000)","v":0},{"$f":"LOOKUP(A28,Gesamt!A$4:A$1000,Gesamt!M$4:M$1000)","v":0},{"$f":"IF(M28>0,M28*-1,-1000)","v":-1000},{"$f":"IF(M28>0,RANK(N28,N:N),0)","v":0}]
[721,{"$f":"LOOKUP(A29,Gesamt!A$4:A$1000,Gesamt!B$4:B$1000)","v":0},{"$f":"LOOKUP(A29,Gesamt!A$4:A$1000,Gesamt!C$4:C$1000)","v":0},{"$f":"LOOKUP(A29,Gesamt!A$4:A$1000,Gesamt!D$4:D$1000)","v":0},{"$f":"LOOKUP(A29,Gesamt!A$4:A$1000,Gesamt!E$4:E$1000)","v":0},{"$f":"LOOKUP(A29,Gesamt!A$4:A$1000,Gesamt!F$4:F$1000)","v":0},{"$f":"LOOKUP(A29,Gesamt!A$4:A$1000,Gesamt!G$4:G$1000)","v":0},{"$f":"LOOKUP(A29,Gesamt!A$4:A$1000,Gesamt!H$4:H$1000)","v":0},{"$f":"LOOKUP(A29,Gesamt!A$4:A$1000,Gesamt!I$4:I$1000)","v":0},{"$f":"LOOKUP(A29,Gesamt!A$4:A$1000,Gesamt!J$4:J$1000)","v":0},{"$f":"LOOKUP(A29,Gesamt!A$4:A$1000,Gesamt!K$4:K$1000)","v":0},{"$f":"LOOKUP(A29,Gesamt!A$4:A$1000,Gesamt!L$4:L$1000)","v":0},{"$f":"LOOKUP(A29,Gesamt!A$4:A$1000,Gesamt!M$4:M$1000)","v":0},{"$f":"IF(M29>0,M29*-1,-1000)","v":-1000},{"$f":"IF(M29>0,RANK(N29,N:N),0)","v":0}]
[722,{"$f":"LOOKUP(A30,Gesamt!A$4:A$1000,Gesamt!B$4:B$1000)","v":0},{"$f":"LOOKUP(A30,Gesamt!A$4:A$1000,Gesamt!C$4:C$1000)","v":0},{"$f":"LOOKUP(A30,Gesamt!A$4:A$1000,Gesamt!D$4:D$1000)","v":0},{"$f":"LOOKUP(A30,Gesamt!A$4:A$1000,Gesamt!E$4:E$1000)","v":0},{"$f":"LOOKUP(A30,Gesamt!A$4:A$1000,Gesamt!F$4:F$1000)","v":0},{"$f":"LOOKUP(A30,Gesamt!A$4:A$1000,Gesamt!G$4:G$1000)","v":0},{"$f":"LOOKUP(A30,Gesamt!A$4:A$1000,Gesamt!H$4:H$1000)","v":0},{"$f":"LOOKUP(A30,Gesamt!A$4:A$1000,Gesamt!I$4:I$1000)","v":0},{"$f":"LOOKUP(A30,Gesamt!A$4:A$1000,Gesamt!J$4:J$1000)","v":0},{"$f":"LOOKUP(A30,Gesamt!A$4:A$1000,Gesamt!K$4:K$1000)","v":0},{"$f":"LOOKUP(A30,Gesamt!A$4:A$1000,Gesamt!L$4:L$1000)","v":0},{"$f":"LOOKUP(A30,Gesamt!A$4:A$1000,Gesamt!M$4:M$1000)","v":0},{"$f":"IF(M30>0,M30*-1,-1000)","v":-1000},{"$f":"IF(M30>0,RANK(N30,N:N),0)","v":0}]
[723,{"$f":"LOOKUP(A31,Gesamt!A$4:A$1000,Gesamt!B$4:B$1000)","v":0},{"$f":"LOOKUP(A31,Gesamt!A$4:A$1000,Gesamt!C$4:C$1000)","v":0},{"$f":"LOOKUP(A31,Gesamt!A$4:A$1000,Gesamt!D$4:D$1000)","v":0},{"$f":"LOOKUP(A31,Gesamt!A$4:A$1000,Gesamt!E$4:E$1000)","v":0},{"$f":"LOOKUP(A31,Gesamt!A$4:A$1000,Gesamt!F$4:F$1000)","v":0},{"$f":"LOOKUP(A31,Gesamt!A$4:A$1000,Gesamt!G$4:G$1000)","v":0},{"$f":"LOOKUP(A31,Gesamt!A$4:A$1000,Gesamt!H$4:H$1000)","v":0},{"$f":"LOOKUP(A31,Gesamt!A$4:A$1000,Gesamt!I$4:I$1000)","v":0},{"$f":"LOOKUP(A31,Gesamt!A$4:A$1000,Gesamt!J$4:J$1000)","v":0},{"$f":"LOOKUP(A31,Gesamt!A$4:A$1000,Gesamt!K$4:K$1000)","v":0},{"$f":"LOOKUP(A31,Gesamt!A$4:A$1000,Gesamt!L$4:L$1000)","v":0},{"$f":"LOOKUP(A31,Gesamt!A$4:A$1000,Gesamt!M$4:M$1000)","v":0},{"$f":"IF(M31>0,M31*-1,-1000)","v":-1000},{"$f":"IF(M31>0,RANK(N31,N:N),0)","v":0}]
[724,{"$f":"LOOKUP(A32,Gesamt!A$4:A$1000,Gesamt!B$4:B$1000)","v":0},{"$f":"LOOKUP(A32,Gesamt!A$4:A$1000,Gesamt!C$4:C$1000)","v":0},{"$f":"LOOKUP(A32,Gesamt!A$4:A$1000,Gesamt!D$4:D$1000)","v":0},{"$f":"LOOKUP(A32,Gesamt!A$4:A$1000,Gesamt!E$4:E$1000)","v":0},{"$f":"LOOKUP(A32,Gesamt!A$4:A$1000,Gesamt!F$4:F$1000)","v":0},{"$f":"LOOKUP(A32,Gesamt!A$4:A$1000,Gesamt!G$4:G$1000)","v":0},{"$f":"LOOKUP(A32,Gesamt!A$4:A$1000,Gesamt!H$4:H$1000)","v":0},{"$f":"LOOKUP(A32,Gesamt!A$4:A$1000,Gesamt!I$4:I$1000)","v":0},{"$f":"LOOKUP(A32,Gesamt!A$4:A$1000,Gesamt!J$4:J$1000)","v":0},{"$f":"LOOKUP(A32,Gesamt!A$4:A$1000,Gesamt!K$4:K$1000)","v":0},{"$f":"LOOKUP(A32,Gesamt!A$4:A$1000,Gesamt!L$4:L$1000)","v":0},{"$f":"LOOKUP(A32,Gesamt!A$4:A$1000,Gesamt!M$4:M$1000)","v":0},{"$f":"IF(M32>0,M32*-1,-1000)","v":-1000},{"$f":"IF(M32>0,RANK(N32,N:N),0)","v":0}]
[725,{"$f":"LOOKUP(A33,Gesamt!A$4:A$1000,Gesamt!B$4:B$1000)","v":0},{"$f":"LOOKUP(A33,Gesamt!A$4:A$1000,Gesamt!C$4:C$1000)","v":0},{"$f":"LOOKUP(A33,Gesamt!A$4:A$1000,Gesamt!D$4:D$1000)","v":0},{"$f":"LOOKUP(A33,Gesamt!A$4:A$1000,Gesamt!E$4:E$1000)","v":0},{"$f":"LOOKUP(A33,Gesamt!A$4:A$1000,Gesamt!F$4:F$1000)","v":0},{"$f":"LOOKUP(A33,Gesamt!A$4:A$1000,Gesamt!G$4:G$1000)","v":0},{"$f":"LOOKUP(A33,Gesamt!A$4:A$1000,Gesamt!H$4:H$1000)","v":0},{"$f":"LOOKUP(A33,Gesamt!A$4:A$1000,Gesamt!I$4:I$1000)","v":0},{"$f":"LOOKUP(A33,Gesamt!A$4:A$1000,Gesamt!J$4:J$1000)","v":0},{"$f":"LOOKUP(A33,Gesamt!A$4:A$1000,Gesamt!K$4:K$1000)","v":0},{"$f":"LOOKUP(A33,Gesamt!A$4:A$1000,Gesamt!L$4:L$1000)","v":0},{"$f":"LOOKUP(A33,Gesamt!A$4:A$1000,Gesamt!M$4:M$1000)","v":0},{"$f":"IF(M33>0,M33*-1,-1000)","v":-1000},{"$f":"IF(M33>0,RANK(N33,N:N),0)","v":0}]
[726,{"$f":"LOOKUP(A34,Gesamt!A$4:A$1000,Gesamt!B$4:B$1000)","v":0},{"$f":"LOOKUP(A34,Gesamt!A$4:A$1000,Gesamt!C$4:C$1000)","v":0},{"$f":"LOOKUP(A34,Gesamt!A$4:A$1000,Gesamt!D$4:D$1000)","v":0},{"$f":"LOOKUP(A34,Gesamt!A$4:A$1000,Gesamt!E$4:E$1000)","v":0},{"$f":"LOOKUP(A34,Gesamt!A$4:A$1000,Gesamt!F$4:F$1000)","v":0},{"$f":"LOOKUP(A34,Gesamt!A$4:A$1000,Gesamt!G$4:G$1000)","v":0},{"$f":"LOOKUP(A34,Gesamt!A$4:A$1000,Gesamt!H$4:H$1000)","v":0},{"$f":"LOOKUP(A34,Gesamt!A$4:A$1000,Gesamt!I$4:I$1000)","v":0},{"$f":"LOOKUP(A34,Gesamt!A$4:A$1000,Gesamt!J$4:J$1000)","v":0},{"$f":"LOOKUP(A34,Gesamt!A$4:A$1000,Gesamt!K$4:K$1000)","v":0},{"$f":"LOOKUP(A34,Gesamt!A$4:A$1000,Gesamt!L$4:L$1000)","v":0},{"$f":"LOOKUP(A34,Gesamt!A$4:A$1000,Gesamt!M$4:M$1000)","v":0},{"$f":"IF(M34>0,M34*-1,-1000)","v":-1000},{"$f":"IF(M34>0,RANK(N34,N:N),0)","v":0}]
[727,{"$f":"LOOKUP(A35,Gesamt!A$4:A$1000,Gesamt!B$4:B$1000)","v":0},{"$f":"LOOKUP(A35,Gesamt!A$4:A$1000,Gesamt!C$4:C$1000)","v":0},{"$f":"LOOKUP(A35,Gesamt!A$4:A$1000,Gesamt!D$4:D$1000)","v":0},{"$f":"LOOKUP(A35,Gesamt!A$4:A$1000,Gesamt!E$4:E$1000)","v":0},{"$f":"LOOKUP(A35,Gesamt!A$4:A$1000,Gesamt!F$4:F$1000)","v":0},{"$f":"LOOKUP(A35,Gesamt!A$4:A$1000,Gesamt!G$4:G$1000)","v":0},{"$f":"LOOKUP(A35,Gesamt!A$4:A$1000,Gesamt!H$4:H$1000)","v":0},{"$f":"LOOKUP(A35,Gesamt!A$4:A$1000,Gesamt!I$4:I$1000)","v":0},{"$f":"LOOKUP(A35,Gesamt!A$4:A$1000,Gesamt!J$4:J$1000)","v":0},{"$f":"LOOKUP(A35,Gesamt!A$4:A$1000,Gesamt!K$4:K$1000)","v":0},{"$f":"LOOKUP(A35,Gesamt!A$4:A$1000,Gesamt!L$4:L$1000)","v":0},{"$f":"LOOKUP(A35,Gesamt!A$4:A$1000,Gesamt!M$4:M$1000)","v":0},{"$f":"IF(M35>0,M35*-1,-1000)","v":-1000},{"$f":"IF(M35>0,RANK(N35,N:N),0)","v":0}]
[728,{"$f":"LOOKUP(A36,Gesamt!A$4:A$1000,Gesamt!B$4:B$1000)","v":0},{"$f":"LOOKUP(A36,Gesamt!A$4:A$1000,Gesamt!C$4:C$1000)","v":0},{"$f":"LOOKUP(A36,Gesamt!A$4:A$1000,Gesamt!D$4:D$1000)","v":0},{"$f":"LOOKUP(A36,Gesamt!A$4:A$1000,Gesamt!E$4:E$1000)","v":0},{"$f":"LOOKUP(A36,Gesamt!A$4:A$1000,Gesamt!F$4:F$1000)","v":0},{"$f":"LOOKUP(A36,Gesamt!A$4:A$1000,Gesamt!G$4:G$1000)","v":0},{"$f":"LOOKUP(A36,Gesamt!A$4:A$1000,Gesamt!H$4:H$1000)","v":0},{"$f":"LOOKUP(A36,Gesamt!A$4:A$1000,Gesamt!I$4:I$1000)","v":0},{"$f":"LOOKUP(A36,Gesamt!A$4:A$1000,Gesamt!J$4:J$1000)","v":0},{"$f":"LOOKUP(A36,Gesamt!A$4:A$1000,Gesamt!K$4:K$1000)","v":0},{"$f":"LOOKUP(A36,Gesamt!A$4:A$1000,Gesamt!L$4:L$1000)","v":0},{"$f":"LOOKUP(A36,Gesamt!A$4:A$1000,Gesamt!M$4:M$1000)","v":0},{"$f":"IF(M36>0,M36*-1,-1000)","v":-1000},{"$f":"IF(M36>0,RANK(N36,N:N),0)","v":0}]
[729,{"$f":"LOOKUP(A37,Gesamt!A$4:A$1000,Gesamt!B$4:B$1000)","v":0},{"$f":"LOOKUP(A37,Gesamt!A$4:A$1000,Gesamt!C$4:C$1000)","v":0},{"$f":"LOOKUP(A37,Gesamt!A$4:A$1000,Gesamt!D$4:D$1000)","v":0},{"$f":"LOOKUP(A37,Gesamt!A$4:A$1000,Gesamt!E$4:E$1000)","v":0},{"$f":"LOOKUP(A37,Gesamt!A$4:A$1000,Gesamt!F$4:F$1000)","v":0},{"$f":"LOOKUP(A37,Gesamt!A$4:A$1000,Gesamt!G$4:G$1000)","v":0},{"$f":"LOOKUP(A37,Gesamt!A$4:A$1000,Gesamt!H$4:H$1000)","v":0},{"$f":"LOOKUP(A37,Gesamt!A$4:A$1000,Gesamt!I$4:I$1000)","v":0},{"$f":"LOOKUP(A37,Gesamt!A$4:A$1000,Gesamt!J$4:J$1000)","v":0},{"$f":"LOOKUP(A37,Gesamt!A$4:A$1000,Gesamt!K$4:K$1000)","v":0},{"$f":"LOOKUP(A37,Gesamt!A$4:A$1000,Gesamt!L$4:L$1000)","v":0},{"$f":"LOOKUP(A37,Gesamt!A$4:A$1000,Gesamt!M$4:M$1000)","v":0},{"$f":"IF(M37>0,M37*-1,-1000)","v":-1000},{"$f":"IF(M37>0,RANK(N37,N:N),0)","v":0}]
[730,{"$f":"LOOKUP(A38,Gesamt!A$4:A$1000,Gesamt!B$4:B$1000)","v":0},{"$f":"LOOKUP(A38,Gesamt!A$4:A$1000,Gesamt!C$4:C$1000)","v":0},{"$f":"LOOKUP(A38,Gesamt!A$4:A$1000,Gesamt!D$4:D$1000)","v":0},{"$f":"LOOKUP(A38,Gesamt!A$4:A$1000,Gesamt!E$4:E$1000)","v":0},{"$f":"LOOKUP(A38,Gesamt!A$4:A$1000,Gesamt!F$4:F$1000)","v":0},{"$f":"LOOKUP(A38,Gesamt!A$4:A$1000,Gesamt!G$4:G$1000)","v":0},{"$f":"LOOKUP(A38,Gesamt!A$4:A$1000,Gesamt!H$4:H$1000)","v":0},{"$f":"LOOKUP(A38,Gesamt!A$4:A$1000,Gesamt!I$4:I$1000)","v":0},{"$f":"LOOKUP(A38,Gesamt!A$4:A$1000,Gesamt!J$4:J$1000)","v":0},{"$f":"LOOKUP(A38,Gesamt!A$4:A$1000,Gesamt!K$4:K$1000)","v":0},{"$f":"LOOKUP(A38,Gesamt!A$4:A$1000,Gesamt!L$4:L$1000)","v":0},{"$f":"LOOKUP(A38,Gesamt!A$4:A$1000,Gesamt!M$4:M$1000)","v":0},{"$f":"IF(M38>0,M38*-1,-1000)","v":-1000},{"$f":"IF(M38>0,RANK(N38,N:N),0)","v":0}]
[731,{"$f":"LOOKUP(A39,Gesamt!A$4:A$1000,Gesamt!B$4:B$1000)","v":0},{"$f":"LOOKUP(A39,Gesamt!A$4:A$1000,Gesamt!C$4:C$1000)","v":0},{"$f":"LOOKUP(A39,Gesamt!A$4:A$1000,Gesamt!D$4:D$1000)","v":0},{"$f":"LOOKUP(A39,Gesamt!A$4:A$1000,Gesamt!E$4:E$1000)","v":0},{"$f":"LOOKUP(A39,Gesamt!A$4:A$1000,Gesamt!F$4:F$1000)","v":0},{"$f":"LOOKUP(A39,Gesamt!A$4:A$1000,Gesamt!G$4:G$1000)","v":0},{"$f":"LOOKUP(A39,Gesamt!A$4:A$1000,Gesamt!H$4:H$1000)","v":0},{"$f":"LOOKUP(A39,Gesamt!A$4:A$1000,Gesamt!I$4:I$1000)","v":0},{"$f":"LOOKUP(A39,Gesamt!A$4:A$1000,Gesamt!J$4:J$1000)","v":0},{"$f":"LOOKUP(A39,Gesamt!A$4:A$1000,Gesamt!K$4:K$1000)","v":0},{"$f":"LOOKUP(A39,Gesamt!A$4:A$1000,Gesamt!L$4:L$1000)","v":0},{"$f":"LOOKUP(A39,Gesamt!A$4:A$1000,Gesamt!M$4:M$1000)","v":0},{"$f":"IF(M39>0,M39*-1,-1000)","v":-1000},{"$f":"IF(M39>0,RANK(N39,N:N),0)","v":0}]
[732,{"$f":"LOOKUP(A40,Gesamt!A$4:A$1000,Gesamt!B$4:B$1000)","v":0},{"$f":"LOOKUP(A40,Gesamt!A$4:A$1000,Gesamt!C$4:C$1000)","v":0},{"$f":"LOOKUP(A40,Gesamt!A$4:A$1000,Gesamt!D$4:D$1000)","v":0},{"$f":"LOOKUP(A40,Gesamt!A$4:A$1000,Gesamt!E$4:E$1000)","v":0},{"$f":"LOOKUP(A40,Gesamt!A$4:A$1000,Gesamt!F$4:F$1000)","v":0},{"$f":"LOOKUP(A40,Gesamt!A$4:A$1000,Gesamt!G$4:G$1000)","v":0},{"$f":"LOOKUP(A40,Gesamt!A$4:A$1000,Gesamt!H$4:H$1000)","v":0},{"$f":"LOOKUP(A40,Gesamt!A$4:A$1000,Gesamt!I$4:I$1000)","v":0},{"$f":"LOOKUP(A40,Gesamt!A$4:A$1000,Gesamt!J$4:J$1000)","v":0},{"$f":"LOOKUP(A40,Gesamt!A$4:A$1000,Gesamt!K$4:K$1000)","v":0},{"$f":"LOOKUP(A40,Gesamt!A$4:A$1000,Gesamt!L$4:L$1000)","v":0},{"$f":"LOOKUP(A40,Gesamt!A$4:A$1000,Gesamt!M$4:M$1000)","v":0},{"$f":"IF(M40>0,M40*-1,-1000)","v":-1000},{"$f":"IF(M40>0,RANK(N40,N:N),0)","v":0}]
[733,{"$f":"LOOKUP(A41,Gesamt!A$4:A$1000,Gesamt!B$4:B$1000)","v":0},{"$f":"LOOKUP(A41,Gesamt!A$4:A$1000,Gesamt!C$4:C$1000)","v":0},{"$f":"LOOKUP(A41,Gesamt!A$4:A$1000,Gesamt!D$4:D$1000)","v":0},{"$f":"LOOKUP(A41,Gesamt!A$4:A$1000,Gesamt!E$4:E$1000)","v":0},{"$f":"LOOKUP(A41,Gesamt!A$4:A$1000,Gesamt!F$4:F$1000)","v":0},{"$f":"LOOKUP(A41,Gesamt!A$4:A$1000,Gesamt!G$4:G$1000)","v":0},{"$f":"LOOKUP(A41,Gesamt!A$4:A$1000,Gesamt!H$4:H$1000)","v":0},{"$f":"LOOKUP(A41,Gesamt!A$4:A$1000,Gesamt!I$4:I$1000)","v":0},{"$f":"LOOKUP(A41,Gesamt!A$4:A$1000,Gesamt!J$4:J$1000)","v":0},{"$f":"LOOKUP(A41,Gesamt!A$4:A$1000,Gesamt!K$4:K$1000)","v":0},{"$f":"LOOKUP(A41,Gesamt!A$4:A$1000,Gesamt!L$4:L$1000)","v":0},{"$f":"LOOKUP(A41,Gesamt!A$4:A$1000,Gesamt!M$4:M$1000)","v":0},{"$f":"IF(M41>0,M41*-1,-1000)","v":-1000},{"$f":"IF(M41>0,RANK(N41,N:N),0)","v":0}]
[734,{"$f":"LOOKUP(A42,Gesamt!A$4:A$1000,Gesamt!B$4:B$1000)","v":0},{"$f":"LOOKUP(A42,Gesamt!A$4:A$1000,Gesamt!C$4:C$1000)","v":0},{"$f":"LOOKUP(A42,Gesamt!A$4:A$1000,Gesamt!D$4:D$1000)","v":0},{"$f":"LOOKUP(A42,Gesamt!A$4:A$1000,Gesamt!E$4:E$1000)","v":0},{"$f":"LOOKUP(A42,Gesamt!A$4:A$1000,Gesamt!F$4:F$1000)","v":0},{"$f":"LOOKUP(A42,Gesamt!A$4:A$1000,Gesamt!G$4:G$1000)","v":0},{"$f":"LOOKUP(A42,Gesamt!A$4:A$1000,Gesamt!H$4:H$1000)","v":0},{"$f":"LOOKUP(A42,Gesamt!A$4:A$1000,Gesamt!I$4:I$1000)","v":0},{"$f":"LOOKUP(A42,Gesamt!A$4:A$1000,Gesamt!J$4:J$1000)","v":0},{"$f":"LOOKUP(A42,Gesamt!A$4:A$1000,Gesamt!K$4:K$1000)","v":0},{"$f":"LOOKUP(A42,Gesamt!A$4:A$1000,Gesamt!L$4:L$1000)","v":0},{"$f":"LOOKUP(A42,Gesamt!A$4:A$1000,Gesamt!M$4:M$1000)","v":0},{"$f":"IF(M42>0,M42*-1,-1000)","v":-1000},{"$f":"IF(M42>0,RANK(N42,N:N),0)","v":0}]
[735,{"$f":"LOOKUP(A43,Gesamt!A$4:A$1000,Gesamt!B$4:B$1000)","v":0},{"$f":"LOOKUP(A43,Gesamt!A$4:A$1000,Gesamt!C$4:C$1000)","v":0},{"$f":"LOOKUP(A43,Gesamt!A$4:A$1000,Gesamt!D$4:D$1000)","v":0},{"$f":"LOOKUP(A43,Gesamt!A$4:A$1000,Gesamt!E$4:E$1000)","v":0},{"$f":"LOOKUP(A43,Gesamt!A$4:A$1000,Gesamt!F$4:F$1000)","v":0},{"$f":"LOOKUP(A43,Gesamt!A$4:A$1000,Gesamt!G$4:G$1000)","v":0},{"$f":"LOOKUP(A43,Gesamt!A$4:A$1000,Gesamt!H$4:H$1000)","v":0},{"$f":"LOOKUP(A43,Gesamt!A$4:A$1000,Gesamt!I$4:I$1000)","v":0},{"$f":"LOOKUP(A43,Gesamt!A$4:A$1000,Gesamt!J$4:J$1000)","v":0},{"$f":"LOOKUP(A43,Gesamt!A$4:A$1000,Gesamt!K$4:K$1000)","v":0},{"$f":"LOOKUP(A43,Gesamt!A$4:A$1000,Gesamt!L$4:L$1000)","v":0},{"$f":"LOOKUP(A43,Gesamt!A$4:A$1000,Gesamt!M$4:M$1000)","v":0},{"$f":"IF(M43>0,M43*-1,-1000)","v":-1000},{"$f":"IF(M43>0,RANK(N43,N:N),0)","v":0}]
[736,{"$f":"LOOKUP(A44,Gesamt!A$4:A$1000,Gesamt!B$4:B$1000)","v":0},{"$f":"LOOKUP(A44,Gesamt!A$4:A$1000,Gesamt!C$4:C$1000)","v":0},{"$f":"LOOKUP(A44,Gesamt!A$4:A$1000,Gesamt!D$4:D$1000)","v":0},{"$f":"LOOKUP(A44,Gesamt!A$4:A$1000,Gesamt!E$4:E$1000)","v":0},{"$f":"LOOKUP(A44,Gesamt!A$4:A$1000,Gesamt!F$4:F$1000)","v":0},{"$f":"LOOKUP(A44,Gesamt!A$4:A$1000,Gesamt!G$4:G$1000)","v":0},{"$f":"LOOKUP(A44,Gesamt!A$4:A$1000,Gesamt!H$4:H$1000)","v":0},{"$f":"LOOKUP(A44,Gesamt!A$4:A$1000,Gesamt!I$4:I$1000)","v":0},{"$f":"LOOKUP(A44,Gesamt!A$4:A$1000,Gesamt!J$4:J$1000)","v":0},{"$f":"LOOKUP(A44,Gesamt!A$4:A$1000,Gesamt!K$4:K$1000)","v":0},{"$f":"LOOKUP(A44,Gesamt!A$4:A$1000,Gesamt!L$4:L$1000)","v":0},{"$f":"LOOKUP(A44,Gesamt!A$4:A$1000,Gesamt!M$4:M$1000)","v":0},{"$f":"IF(M44>0,M44*-1,-1000)","v":-1000},{"$f":"IF(M44>0,RANK(N44,N:N),0)","v":0}]
[737,{"$f":"LOOKUP(A45,Gesamt!A$4:A$1000,Gesamt!B$4:B$1000)","v":0},{"$f":"LOOKUP(A45,Gesamt!A$4:A$1000,Gesamt!C$4:C$1000)","v":0},{"$f":"LOOKUP(A45,Gesamt!A$4:A$1000,Gesamt!D$4:D$1000)","v":0},{"$f":"LOOKUP(A45,Gesamt!A$4:A$1000,Gesamt!E$4:E$1000)","v":0},{"$f":"LOOKUP(A45,Gesamt!A$4:A$1000,Gesamt!F$4:F$1000)","v":0},{"$f":"LOOKUP(A45,Gesamt!A$4:A$1000,Gesamt!G$4:G$1000)","v":0},{"$f":"LOOKUP(A45,Gesamt!A$4:A$1000,Gesamt!H$4:H$1000)","v":0},{"$f":"LOOKUP(A45,Gesamt!A$4:A$1000,Gesamt!I$4:I$1000)","v":0},{"$f":"LOOKUP(A45,Gesamt!A$4:A$1000,Gesamt!J$4:J$1000)","v":0},{"$f":"LOOKUP(A45,Gesamt!A$4:A$1000,Gesamt!K$4:K$1000)","v":0},{"$f":"LOOKUP(A45,Gesamt!A$4:A$1000,Gesamt!L$4:L$1000)","v":0},{"$f":"LOOKUP(A45,Gesamt!A$4:A$1000,Gesamt!M$4:M$1000)","v":0},{"$f":"IF(M45>0,M45*-1,-1000)","v":-1000},{"$f":"IF(M45>0,RANK(N45,N:N),0)","v":0}]
[738,{"$f":"LOOKUP(A46,Gesamt!A$4:A$1000,Gesamt!B$4:B$1000)","v":0},{"$f":"LOOKUP(A46,Gesamt!A$4:A$1000,Gesamt!C$4:C$1000)","v":0},{"$f":"LOOKUP(A46,Gesamt!A$4:A$1000,Gesamt!D$4:D$1000)","v":0},{"$f":"LOOKUP(A46,Gesamt!A$4:A$1000,Gesamt!E$4:E$1000)","v":0},{"$f":"LOOKUP(A46,Gesamt!A$4:A$1000,Gesamt!F$4:F$1000)","v":0},{"$f":"LOOKUP(A46,Gesamt!A$4:A$1000,Gesamt!G$4:G$1000)","v":0},{"$f":"LOOKUP(A46,Gesamt!A$4:A$1000,Gesamt!H$4:H$1000)","v":0},{"$f":"LOOKUP(A46,Gesamt!A$4:A$1000,Gesamt!I$4:I$1000)","v":0},{"$f":"LOOKUP(A46,Gesamt!A$4:A$1000,Gesamt!J$4:J$1000)","v":0},{"$f":"LOOKUP(A46,Gesamt!A$4:A$1000,Gesamt!K$4:K$1000)","v":0},{"$f":"LOOKUP(A46,Gesamt!A$4:A$1000,Gesamt!L$4:L$1000)","v":0},{"$f":"LOOKUP(A46,Gesamt!A$4:A$1000,Gesamt!M$4:M$1000)","v":0},{"$f":"IF(M46>0,M46*-1,-1000)","v":-1000},{"$f":"IF(M46>0,RANK(N46,N:N),0)","v":0}]
[739,{"$f":"LOOKUP(A47,Gesamt!A$4:A$1000,Gesamt!B$4:B$1000)","v":0},{"$f":"LOOKUP(A47,Gesamt!A$4:A$1000,Gesamt!C$4:C$1000)","v":0},{"$f":"LOOKUP(A47,Gesamt!A$4:A$1000,Gesamt!D$4:D$1000)","v":0},{"$f":"LOOKUP(A47,Gesamt!A$4:A$1000,Gesamt!E$4:E$1000)","v":0},{"$f":"LOOKUP(A47,Gesamt!A$4:A$1000,Gesamt!F$4:F$1000)","v":0},{"$f":"LOOKUP(A47,Gesamt!A$4:A$1000,Gesamt!G$4:G$1000)","v":0},{"$f":"LOOKUP(A47,Gesamt!A$4:A$1000,Gesamt!H$4:H$1000)","v":0},{"$f":"LOOKUP(A47,Gesamt!A$4:A$1000,Gesamt!I$4:I$1000)","v":0},{"$f":"LOOKUP(A47,Gesamt!A$4:A$1000,Gesamt!J$4:J$1000)","v":0},{"$f":"LOOKUP(A47,Gesamt!A$4:A$1000,Gesamt!K$4:K$1000)","v":0},{"$f":"LOOKUP(A47,Gesamt!A$4:A$1000,Gesamt!L$4:L$1000)","v":0},{"$f":"LOOKUP(A47,Gesamt!A$4:A$1000,Gesamt!M$4:M$1000)","v":0},{"$f":"IF(M47>0,M47*-1,-1000)","v":-1000},{"$f":"IF(M47>0,RANK(N47,N:N),0)","v":0}]
[740,{"$f":"LOOKUP(A48,Gesamt!A$4:A$1000,Gesamt!B$4:B$1000)","v":0},{"$f":"LOOKUP(A48,Gesamt!A$4:A$1000,Gesamt!C$4:C$1000)","v":0},{"$f":"LOOKUP(A48,Gesamt!A$4:A$1000,Gesamt!D$4:D$1000)","v":0},{"$f":"LOOKUP(A48,Gesamt!A$4:A$1000,Gesamt!E$4:E$1000)","v":0},{"$f":"LOOKUP(A48,Gesamt!A$4:A$1000,Gesamt!F$4:F$1000)","v":0},{"$f":"LOOKUP(A48,Gesamt!A$4:A$1000,Gesamt!G$4:G$1000)","v":0},{"$f":"LOOKUP(A48,Gesamt!A$4:A$1000,Gesamt!H$4:H$1000)","v":0},{"$f":"LOOKUP(A48,Gesamt!A$4:A$1000,Gesamt!I$4:I$1000)","v":0},{"$f":"LOOKUP(A48,Gesamt!A$4:A$1000,Gesamt!J$4:J$1000)","v":0},{"$f":"LOOKUP(A48,Gesamt!A$4:A$1000,Gesamt!K$4:K$1000)","v":0},{"$f":"LOOKUP(A48,Gesamt!A$4:A$1000,Gesamt!L$4:L$1000)","v":0},{"$f":"LOOKUP(A48,Gesamt!A$4:A$1000,Gesamt!M$4:M$1000)","v":0},{"$f":"IF(M48>0,M48*-1,-1000)","v":-1000},{"$f":"IF(M48>0,RANK(N48,N:N),0)","v":0}]
[741,{"$f":"LOOKUP(A49,Gesamt!A$4:A$1000,Gesamt!B$4:B$1000)","v":0},{"$f":"LOOKUP(A49,Gesamt!A$4:A$1000,Gesamt!C$4:C$1000)","v":0},{"$f":"LOOKUP(A49,Gesamt!A$4:A$1000,Gesamt!D$4:D$1000)","v":0},{"$f":"LOOKUP(A49,Gesamt!A$4:A$1000,Gesamt!E$4:E$1000)","v":0},{"$f":"LOOKUP(A49,Gesamt!A$4:A$1000,Gesamt!F$4:F$1000)","v":0},{"$f":"LOOKUP(A49,Gesamt!A$4:A$1000,Gesamt!G$4:G$1000)","v":0},{"$f":"LOOKUP(A49,Gesamt!A$4:A$1000,Gesamt!H$4:H$1000)","v":0},{"$f":"LOOKUP(A49,Gesamt!A$4:A$1000,Gesamt!I$4:I$1000)","v":0},{"$f":"LOOKUP(A49,Gesamt!A$4:A$1000,Gesamt!J$4:J$1000)","v":0},{"$f":"LOOKUP(A49,Gesamt!A$4:A$1000,Gesamt!K$4:K$1000)","v":0},{"$f":"LOOKUP(A49,Gesamt!A$4:A$1000,Gesamt!L$4:L$1000)","v":0},{"$f":"LOOKUP(A49,Gesamt!A$4:A$1000,Gesamt!M$4:M$1000)","v":0},{"$f":"IF(M49>0,M49*-1,-1000)","v":-1000},{"$f":"IF(M49>0,RANK(N49,N:N),0)","v":0}]
[742,{"$f":"LOOKUP(A50,Gesamt!A$4:A$1000,Gesamt!B$4:B$1000)","v":0},{"$f":"LOOKUP(A50,Gesamt!A$4:A$1000,Gesamt!C$4:C$1000)","v":0},{"$f":"LOOKUP(A50,Gesamt!A$4:A$1000,Gesamt!D$4:D$1000)","v":0},{"$f":"LOOKUP(A50,Gesamt!A$4:A$1000,Gesamt!E$4:E$1000)","v":0},{"$f":"LOOKUP(A50,Gesamt!A$4:A$1000,Gesamt!F$4:F$1000)","v":0},{"$f":"LOOKUP(A50,Gesamt!A$4:A$1000,Gesamt!G$4:G$1000)","v":0},{"$f":"LOOKUP(A50,Gesamt!A$4:A$1000,Gesamt!H$4:H$1000)","v":0},{"$f":"LOOKUP(A50,Gesamt!A$4:A$1000,Gesamt!I$4:I$1000)","v":0},{"$f":"LOOKUP(A50,Gesamt!A$4:A$1000,Gesamt!J$4:J$1000)","v":0},{"$f":"LOOKUP(A50,Gesamt!A$4:A$1000,Gesamt!K$4:K$1000)","v":0},{"$f":"LOOKUP(A50,Gesamt!A$4:A$1000,Gesamt!L$4:L$1000)","v":0},{"$f":"LOOKUP(A50,Gesamt!A$4:A$1000,Gesamt!M$4:M$1000)","v":0},{"$f":"IF(M50>0,M50*-1,-1000)","v":-1000},{"$f":"IF(M50>0,RANK(N50,N:N),0)","v":0}]
[743,{"$f":"LOOKUP(A51,Gesamt!A$4:A$1000,Gesamt!B$4:B$1000)","v":0},{"$f":"LOOKUP(A51,Gesamt!A$4:A$1000,Gesamt!C$4:C$1000)","v":0},{"$f":"LOOKUP(A51,Gesamt!A$4:A$1000,Gesamt!D$4:D$1000)","v":0},{"$f":"LOOKUP(A51,Gesamt!A$4:A$1000,Gesamt!E$4:E$1000)","v":0},{"$f":"LOOKUP(A51,Gesamt!A$4:A$1000,Gesamt!F$4:F$1000)","v":0},{"$f":"LOOKUP(A51,Gesamt!A$4:A$1000,Gesamt!G$4:G$1000)","v":0},{"$f":"LOOKUP(A51,Gesamt!A$4:A$1000,Gesamt!H$4:H$1000)","v":0},{"$f":"LOOKUP(A51,Gesamt!A$4:A$1000,Gesamt!I$4:I$1000)","v":0},{"$f":"LOOKUP(A51,Gesamt!A$4:A$1000,Gesamt!J$4:J$1000)","v":0},{"$f":"LOOKUP(A51,Gesamt!A$4:A$1000,Gesamt!K$4:K$1000)","v":0},{"$f":"LOOKUP(A51,Gesamt!A$4:A$1000,Gesamt!L$4:L$1000)","v":0},{"$f":"LOOKUP(A51,Gesamt!A$4:A$1000,Gesamt!M$4:M$1000)","v":0},{"$f":"IF(M51>0,M51*-1,-1000)","v":-1000},{"$f":"IF(M51>0,RANK(N51,N:N),0)","v":0}]
[744,{"$f":"LOOKUP(A52,Gesamt!A$4:A$1000,Gesamt!B$4:B$1000)","v":0},{"$f":"LOOKUP(A52,Gesamt!A$4:A$1000,Gesamt!C$4:C$1000)","v":0},{"$f":"LOOKUP(A52,Gesamt!A$4:A$1000,Gesamt!D$4:D$1000)","v":0},{"$f":"LOOKUP(A52,Gesamt!A$4:A$1000,Gesamt!E$4:E$1000)","v":0},{"$f":"LOOKUP(A52,Gesamt!A$4:A$1000,Gesamt!F$4:F$1000)","v":0},{"$f":"LOOKUP(A52,Gesamt!A$4:A$1000,Gesamt!G$4:G$1000)","v":0},{"$f":"LOOKUP(A52,Gesamt!A$4:A$1000,Gesamt!H$4:H$1000)","v":0},{"$f":"LOOKUP(A52,Gesamt!A$4:A$1000,Gesamt!I$4:I$1000)","v":0},{"$f":"LOOKUP(A52,Gesamt!A$4:A$1000,Gesamt!J$4:J$1000)","v":0},{"$f":"LOOKUP(A52,Gesamt!A$4:A$1000,Gesamt!K$4:K$1000)","v":0},{"$f":"LOOKUP(A52,Gesamt!A$4:A$1000,Gesamt!L$4:L$1000)","v":0},{"$f":"LOOKUP(A52,Gesamt!A$4:A$1000,Gesamt!M$4:M$1000)","v":0},{"$f":"IF(M52>0,M52*-1,-1000)","v":-1000},{"$f":"IF(M52>0,RANK(N52,N:N),0)","v":0}]
[745,{"$f":"LOOKUP(A53,Gesamt!A$4:A$1000,Gesamt!B$4:B$1000)","v":0},{"$f":"LOOKUP(A53,Gesamt!A$4:A$1000,Gesamt!C$4:C$1000)","v":0},{"$f":"LOOKUP(A53,Gesamt!A$4:A$1000,Gesamt!D$4:D$1000)","v":0},{"$f":"LOOKUP(A53,Gesamt!A$4:A$1000,Gesamt!E$4:E$1000)","v":0},{"$f":"LOOKUP(A53,Gesamt!A$4:A$1000,Gesamt!F$4:F$1000)","v":0},{"$f":"LOOKUP(A53,Gesamt!A$4:A$1000,Gesamt!G$4:G$1000)","v":0},{"$f":"LOOKUP(A53,Gesamt!A$4:A$1000,Gesamt!H$4:H$1000)","v":0},{"$f":"LOOKUP(A53,Gesamt!A$4:A$1000,Gesamt!I$4:I$1000)","v":0},{"$f":"LOOKUP(A53,Gesamt!A$4:A$1000,Gesamt!J$4:J$1000)","v":0},{"$f":"LOOKUP(A53,Gesamt!A$4:A$1000,Gesamt!K$4:K$1000)","v":0},{"$f":"LOOKUP(A53,Gesamt!A$4:A$1000,Gesamt!L$4:L$1000)","v":0},{"$f":"LOOKUP(A53,Gesamt!A$4:A$1000,Gesamt!M$4:M$1000)","v":0},{"$f":"IF(M53>0,M53*-1,-1000)","v":-1000},{"$f":"IF(M53>0,RANK(N53,N:N),0)","v":0}]
[746,{"$f":"LOOKUP(A54,Gesamt!A$4:A$1000,Gesamt!B$4:B$1000)","v":0},{"$f":"LOOKUP(A54,Gesamt!A$4:A$1000,Gesamt!C$4:C$1000)","v":0},{"$f":"LOOKUP(A54,Gesamt!A$4:A$1000,Gesamt!D$4:D$1000)","v":0},{"$f":"LOOKUP(A54,Gesamt!A$4:A$1000,Gesamt!E$4:E$1000)","v":0},{"$f":"LOOKUP(A54,Gesamt!A$4:A$1000,Gesamt!F$4:F$1000)","v":0},{"$f":"LOOKUP(A54,Gesamt!A$4:A$1000,Gesamt!G$4:G$1000)","v":0},{"$f":"LOOKUP(A54,Gesamt!A$4:A$1000,Gesamt!H$4:H$1000)","v":0},{"$f":"LOOKUP(A54,Gesamt!A$4:A$1000,Gesamt!I$4:I$1000)","v":0},{"$f":"LOOKUP(A54,Gesamt!A$4:A$1000,Gesamt!J$4:J$1000)","v":0},{"$f":"LOOKUP(A54,Gesamt!A$4:A$1000,Gesamt!K$4:K$1000)","v":0},{"$f":"LOOKUP(A54,Gesamt!A$4:A$1000,Gesamt!L$4:L$1000)","v":0},{"$f":"LOOKUP(A54,Gesamt!A$4:A$1000,Gesamt!M$4:M$1000)","v":0},{"$f":"IF(M54>0,M54*-1,-1000)","v":-1000},{"$f":"IF(M54>0,RANK(N54,N:N),0)","v":0}]
[747,{"$f":"LOOKUP(A55,Gesamt!A$4:A$1000,Gesamt!B$4:B$1000)","v":0},{"$f":"LOOKUP(A55,Gesamt!A$4:A$1000,Gesamt!C$4:C$1000)","v":0},{"$f":"LOOKUP(A55,Gesamt!A$4:A$1000,Gesamt!D$4:D$1000)","v":0},{"$f":"LOOKUP(A55,Gesamt!A$4:A$1000,Gesamt!E$4:E$1000)","v":0},{"$f":"LOOKUP(A55,Gesamt!A$4:A$1000,Gesamt!F$4:F$1000)","v":0},{"$f":"LOOKUP(A55,Gesamt!A$4:A$1000,Gesamt!G$4:G$1000)","v":0},{"$f":"LOOKUP(A55,Gesamt!A$4:A$1000,Gesamt!H$4:H$1000)","v":0},{"$f":"LOOKUP(A55,Gesamt!A$4:A$1000,Gesamt!I$4:I$1000)","v":0},{"$f":"LOOKUP(A55,Gesamt!A$4:A$1000,Gesamt!J$4:J$1000)","v":0},{"$f":"LOOKUP(A55,Gesamt!A$4:A$1000,Gesamt!K$4:K$1000)","v":0},{"$f":"LOOKUP(A55,Gesamt!A$4:A$1000,Gesamt!L$4:L$1000)","v":0},{"$f":"LOOKUP(A55,Gesamt!A$4:A$1000,Gesamt!M$4:M$1000)","v":0},{"$f":"IF(M55>0,M55*-1,-1000)","v":-1000},{"$f":"IF(M55>0,RANK(N55,N:N),0)","v":0}]
[748,{"$f":"LOOKUP(A56,Gesamt!A$4:A$1000,Gesamt!B$4:B$1000)","v":0},{"$f":"LOOKUP(A56,Gesamt!A$4:A$1000,Gesamt!C$4:C$1000)","v":0},{"$f":"LOOKUP(A56,Gesamt!A$4:A$1000,Gesamt!D$4:D$1000)","v":0},{"$f":"LOOKUP(A56,Gesamt!A$4:A$1000,Gesamt!E$4:E$1000)","v":0},{"$f":"LOOKUP(A56,Gesamt!A$4:A$1000,Gesamt!F$4:F$1000)","v":0},{"$f":"LOOKUP(A56,Gesamt!A$4:A$1000,Gesamt!G$4:G$1000)","v":0},{"$f":"LOOKUP(A56,Gesamt!A$4:A$1000,Gesamt!H$4:H$1000)","v":0},{"$f":"LOOKUP(A56,Gesamt!A$4:A$1000,Gesamt!I$4:I$1000)","v":0},{"$f":"LOOKUP(A56,Gesamt!A$4:A$1000,Gesamt!J$4:J$1000)","v":0},{"$f":"LOOKUP(A56,Gesamt!A$4:A$1000,Gesamt!K$4:K$1000)","v":0},{"$f":"LOOKUP(A56,Gesamt!A$4:A$1000,Gesamt!L$4:L$1000)","v":0},{"$f":"LOOKUP(A56,Gesamt!A$4:A$1000,Gesamt!M$4:M$1000)","v":0},{"$f":"IF(M56>0,M56*-1,-1000)","v":-1000},{"$f":"IF(M56>0,RANK(N56,N:N),0)","v":0}]
[749,{"$f":"LOOKUP(A57,Gesamt!A$4:A$1000,Gesamt!B$4:B$1000)","v":0},{"$f":"LOOKUP(A57,Gesamt!A$4:A$1000,Gesamt!C$4:C$1000)","v":0},{"$f":"LOOKUP(A57,Gesamt!A$4:A$1000,Gesamt!D$4:D$1000)","v":0},{"$f":"LOOKUP(A57,Gesamt!A$4:A$1000,Gesamt!E$4:E$1000)","v":0},{"$f":"LOOKUP(A57,Gesamt!A$4:A$1000,Gesamt!F$4:F$1000)","v":0},{"$f":"LOOKUP(A57,Gesamt!A$4:A$1000,Gesamt!G$4:G$1000)","v":0},{"$f":"LOOKUP(A57,Gesamt!A$4:A$1000,Gesamt!H$4:H$1000)","v":0},{"$f":"LOOKUP(A57,Gesamt!A$4:A$1000,Gesamt!I$4:I$1000)","v":0},{"$f":"LOOKUP(A57,Gesamt!A$4:A$1000,Gesamt!J$4:J$1000)","v":0},{"$f":"LOOKUP(A57,Gesamt!A$4:A$1000,Gesamt!K$4:K$1000)","v":0},{"$f":"LOOKUP(A57,Gesamt!A$4:A$1000,Gesamt!L$4:L$1000)","v":0},{"$f":"LOOKUP(A57,Gesamt!A$4:A$1000,Gesamt!M$4:M$1000)","v":0},{"$f":"IF(M57>0,M57*-1,-1000)","v":-1000},{"$f":"IF(M57>0,RANK(N57,N:N),0)","v":0}]
[750,{"$f":"LOOKUP(A58,Gesamt!A$4:A$1000,Gesamt!B$4:B$1000)","v":0},{"$f":"LOOKUP(A58,Gesamt!A$4:A$1000,Gesamt!C$4:C$1000)","v":0},{"$f":"LOOKUP(A58,Gesamt!A$4:A$1000,Gesamt!D$4:D$1000)","v":0},{"$f":"LOOKUP(A58,Gesamt!A$4:A$1000,Gesamt!E$4:E$1000)","v":0},{"$f":"LOOKUP(A58,Gesamt!A$4:A$1000,Gesamt!F$4:F$1000)","v":0},{"$f":"LOOKUP(A58,Gesamt!A$4:A$1000,Gesamt!G$4:G$1000)","v":0},{"$f":"LOOKUP(A58,Gesamt!A$4:A$1000,Gesamt!H$4:H$1000)","v":0},{"$f":"LOOKUP(A58,Gesamt!A$4:A$1000,Gesamt!I$4:I$1000)","v":0},{"$f":"LOOKUP(A58,Gesamt!A$4:A$1000,Gesamt!J$4:J$1000)","v":0},{"$f":"LOOKUP(A58,Gesamt!A$4:A$1000,Gesamt!K$4:K$1000)","v":0},{"$f":"LOOKUP(A58,Gesamt!A$4:A$1000,Gesamt!L$4:L$1000)","v":0},{"$f":"LOOKUP(A58,Gesamt!A$4:A$1000,Gesamt!M$4:M$1000)","v":0},{"$f":"IF(M58>0,M58*-1,-1000)","v":-1000},{"$f":"IF(M58>0,RANK(N58,N:N),0)","v":0}]
[751,{"$f":"LOOKUP(A59,Gesamt!A$4:A$1000,Gesamt!B$4:B$1000)","v":0},{"$f":"LOOKUP(A59,Gesamt!A$4:A$1000,Gesamt!C$4:C$1000)","v":0},{"$f":"LOOKUP(A59,Gesamt!A$4:A$1000,Gesamt!D$4:D$1000)","v":0},{"$f":"LOOKUP(A59,Gesamt!A$4:A$1000,Gesamt!E$4:E$1000)","v":0},{"$f":"LOOKUP(A59,Gesamt!A$4:A$1000,Gesamt!F$4:F$1000)","v":0},{"$f":"LOOKUP(A59,Gesamt!A$4:A$1000,Gesamt!G$4:G$1000)","v":0},{"$f":"LOOKUP(A59,Gesamt!A$4:A$1000,Gesamt!H$4:H$1000)","v":0},{"$f":"LOOKUP(A59,Gesamt!A$4:A$1000,Gesamt!I$4:I$1000)","v":0},{"$f":"LOOKUP(A59,Gesamt!A$4:A$1000,Gesamt!J$4:J$1000)","v":0},{"$f":"LOOKUP(A59,Gesamt!A$4:A$1000,Gesamt!K$4:K$1000)","v":0},{"$f":"LOOKUP(A59,Gesamt!A$4:A$1000,Gesamt!L$4:L$1000)","v":0},{"$f":"LOOKUP(A59,Gesamt!A$4:A$1000,Gesamt!M$4:M$1000)","v":0},{"$f":"IF(M59>0,M59*-1,-1000)","v":-1000},{"$f":"IF(M59>0,RANK(N59,N:N),0)","v":0}]
[752,{"$f":"LOOKUP(A60,Gesamt!A$4:A$1000,Gesamt!B$4:B$1000)","v":0},{"$f":"LOOKUP(A60,Gesamt!A$4:A$1000,Gesamt!C$4:C$1000)","v":0},{"$f":"LOOKUP(A60,Gesamt!A$4:A$1000,Gesamt!D$4:D$1000)","v":0},{"$f":"LOOKUP(A60,Gesamt!A$4:A$1000,Gesamt!E$4:E$1000)","v":0},{"$f":"LOOKUP(A60,Gesamt!A$4:A$1000,Gesamt!F$4:F$1000)","v":0},{"$f":"LOOKUP(A60,Gesamt!A$4:A$1000,Gesamt!G$4:G$1000)","v":0},{"$f":"LOOKUP(A60,Gesamt!A$4:A$1000,Gesamt!H$4:H$1000)","v":0},{"$f":"LOOKUP(A60,Gesamt!A$4:A$1000,Gesamt!I$4:I$1000)","v":0},{"$f":"LOOKUP(A60,Gesamt!A$4:A$1000,Gesamt!J$4:J$1000)","v":0},{"$f":"LOOKUP(A60,Gesamt!A$4:A$1000,Gesamt!K$4:K$1000)","v":0},{"$f":"LOOKUP(A60,Gesamt!A$4:A$1000,Gesamt!L$4:L$1000)","v":0},{"$f":"LOOKUP(A60,Gesamt!A$4:A$1000,Gesamt!M$4:M$1000)","v":0},{"$f":"IF(M60>0,M60*-1,-1000)","v":-1000},{"$f":"IF(M60>0,RANK(N60,N:N),0)","v":0}]
[753,{"$f":"LOOKUP(A61,Gesamt!A$4:A$1000,Gesamt!B$4:B$1000)","v":0},{"$f":"LOOKUP(A61,Gesamt!A$4:A$1000,Gesamt!C$4:C$1000)","v":0},{"$f":"LOOKUP(A61,Gesamt!A$4:A$1000,Gesamt!D$4:D$1000)","v":0},{"$f":"LOOKUP(A61,Gesamt!A$4:A$1000,Gesamt!E$4:E$1000)","v":0},{"$f":"LOOKUP(A61,Gesamt!A$4:A$1000,Gesamt!F$4:F$1000)","v":0},{"$f":"LOOKUP(A61,Gesamt!A$4:A$1000,Gesamt!G$4:G$1000)","v":0},{"$f":"LOOKUP(A61,Gesamt!A$4:A$1000,Gesamt!H$4:H$1000)","v":0},{"$f":"LOOKUP(A61,Gesamt!A$4:A$1000,Gesamt!I$4:I$1000)","v":0},{"$f":"LOOKUP(A61,Gesamt!A$4:A$1000,Gesamt!J$4:J$1000)","v":0},{"$f":"LOOKUP(A61,Gesamt!A$4:A$1000,Gesamt!K$4:K$1000)","v":0},{"$f":"LOOKUP(A61,Gesamt!A$4:A$1000,Gesamt!L$4:L$1000)","v":0},{"$f":"LOOKUP(A61,Gesamt!A$4:A$1000,Gesamt!M$4:M$1000)","v":0},{"$f":"IF(M61>0,M61*-1,-1000)","v":-1000},{"$f":"IF(M61>0,RANK(N61,N:N),0)","v":0}]
[754,{"$f":"LOOKUP(A62,Gesamt!A$4:A$1000,Gesamt!B$4:B$1000)","v":0},{"$f":"LOOKUP(A62,Gesamt!A$4:A$1000,Gesamt!C$4:C$1000)","v":0},{"$f":"LOOKUP(A62,Gesamt!A$4:A$1000,Gesamt!D$4:D$1000)","v":0},{"$f":"LOOKUP(A62,Gesamt!A$4:A$1000,Gesamt!E$4:E$1000)","v":0},{"$f":"LOOKUP(A62,Gesamt!A$4:A$1000,Gesamt!F$4:F$1000)","v":0},{"$f":"LOOKUP(A62,Gesamt!A$4:A$1000,Gesamt!G$4:G$1000)","v":0},{"$f":"LOOKUP(A62,Gesamt!A$4:A$1000,Gesamt!H$4:H$1000)","v":0},{"$f":"LOOKUP(A62,Gesamt!A$4:A$1000,Gesamt!I$4:I$1000)","v":0},{"$f":"LOOKUP(A62,Gesamt!A$4:A$1000,Gesamt!J$4:J$1000)","v":0},{"$f":"LOOKUP(A62,Gesamt!A$4:A$1000,Gesamt!K$4:K$1000)","v":0},{"$f":"LOOKUP(A62,Gesamt!A$4:A$1000,Gesamt!L$4:L$1000)","v":0},{"$f":"LOOKUP(A62,Gesamt!A$4:A$1000,Gesamt!M$4:M$1000)","v":0},{"$f":"IF(M62>0,M62*-1,-1000)","v":-1000},{"$f":"IF(M62>0,RANK(N62,N:N),0)","v":0}]
[755,{"$f":"LOOKUP(A63,Gesamt!A$4:A$1000,Gesamt!B$4:B$1000)","v":0},{"$f":"LOOKUP(A63,Gesamt!A$4:A$1000,Gesamt!C$4:C$1000)","v":0},{"$f":"LOOKUP(A63,Gesamt!A$4:A$1000,Gesamt!D$4:D$1000)","v":0},{"$f":"LOOKUP(A63,Gesamt!A$4:A$1000,Gesamt!E$4:E$1000)","v":0},{"$f":"LOOKUP(A63,Gesamt!A$4:A$1000,Gesamt!F$4:F$1000)","v":0},{"$f":"LOOKUP(A63,Gesamt!A$4:A$1000,Gesamt!G$4:G$1000)","v":0},{"$f":"LOOKUP(A63,Gesamt!A$4:A$1000,Gesamt!H$4:H$1000)","v":0},{"$f":"LOOKUP(A63,Gesamt!A$4:A$1000,Gesamt!I$4:I$1000)","v":0},{"$f":"LOOKUP(A63,Gesamt!A$4:A$1000,Gesamt!J$4:J$1000)","v":0},{"$f":"LOOKUP(A63,Gesamt!A$4:A$1000,Gesamt!K$4:K$1000)","v":0},{"$f":"LOOKUP(A63,Gesamt!A$4:A$1000,Gesamt!L$4:L$1000)","v":0},{"$f":"LOOKUP(A63,Gesamt!A$4:A$1000,Gesamt!M$4:M$1000)","v":0},{"$f":"IF(M63>0,M63*-1,-1000)","v":-1000},{"$f":"IF(M63>0,RANK(N63,N:N),0)","v":0}]
[756,{"$f":"LOOKUP(A64,Gesamt!A$4:A$1000,Gesamt!B$4:B$1000)","v":0},{"$f":"LOOKUP(A64,Gesamt!A$4:A$1000,Gesamt!C$4:C$1000)","v":0},{"$f":"LOOKUP(A64,Gesamt!A$4:A$1000,Gesamt!D$4:D$1000)","v":0},{"$f":"LOOKUP(A64,Gesamt!A$4:A$1000,Gesamt!E$4:E$1000)","v":0},{"$f":"LOOKUP(A64,Gesamt!A$4:A$1000,Gesamt!F$4:F$1000)","v":0},{"$f":"LOOKUP(A64,Gesamt!A$4:A$1000,Gesamt!G$4:G$1000)","v":0},{"$f":"LOOKUP(A64,Gesamt!A$4:A$1000,Gesamt!H$4:H$1000)","v":0},{"$f":"LOOKUP(A64,Gesamt!A$4:A$1000,Gesamt!I$4:I$1000)","v":0},{"$f":"LOOKUP(A64,Gesamt!A$4:A$1000,Gesamt!J$4:J$1000)","v":0},{"$f":"LOOKUP(A64,Gesamt!A$4:A$1000,Gesamt!K$4:K$1000)","v":0},{"$f":"LOOKUP(A64,Gesamt!A$4:A$1000,Gesamt!L$4:L$1000)","v":0},{"$f":"LOOKUP(A64,Gesamt!A$4:A$1000,Gesamt!M$4:M$1000)","v":0},{"$f":"IF(M64>0,M64*-1,-1000)","v":-1000},{"$f":"IF(M64>0,RANK(N64,N:N),0)","v":0}]
[757,{"$f":"LOOKUP(A65,Gesamt!A$4:A$1000,Gesamt!B$4:B$1000)","v":0},{"$f":"LOOKUP(A65,Gesamt!A$4:A$1000,Gesamt!C$4:C$1000)","v":0},{"$f":"LOOKUP(A65,Gesamt!A$4:A$1000,Gesamt!D$4:D$1000)","v":0},{"$f":"LOOKUP(A65,Gesamt!A$4:A$1000,Gesamt!E$4:E$1000)","v":0},{"$f":"LOOKUP(A65,Gesamt!A$4:A$1000,Gesamt!F$4:F$1000)","v":0},{"$f":"LOOKUP(A65,Gesamt!A$4:A$1000,Gesamt!G$4:G$1000)","v":0},{"$f":"LOOKUP(A65,Gesamt!A$4:A$1000,Gesamt!H$4:H$1000)","v":0},{"$f":"LOOKUP(A65,Gesamt!A$4:A$1000,Gesamt!I$4:I$1000)","v":0},{"$f":"LOOKUP(A65,Gesamt!A$4:A$1000,Gesamt!J$4:J$1000)","v":0},{"$f":"LOOKUP(A65,Gesamt!A$4:A$1000,Gesamt!K$4:K$1000)","v":0},{"$f":"LOOKUP(A65,Gesamt!A$4:A$1000,Gesamt!L$4:L$1000)","v":0},{"$f":"LOOKUP(A65,Gesamt!A$4:A$1000,Gesamt!M$4:M$1000)","v":0},{"$f":"IF(M65>0,M65*-1,-1000)","v":-1000},{"$f":"IF(M65>0,RANK(N65,N:N),0)","v":0}]
[758,{"$f":"LOOKUP(A66,Gesamt!A$4:A$1000,Gesamt!B$4:B$1000)","v":0},{"$f":"LOOKUP(A66,Gesamt!A$4:A$1000,Gesamt!C$4:C$1000)","v":0},{"$f":"LOOKUP(A66,Gesamt!A$4:A$1000,Gesamt!D$4:D$1000)","v":0},{"$f":"LOOKUP(A66,Gesamt!A$4:A$1000,Gesamt!E$4:E$1000)","v":0},{"$f":"LOOKUP(A66,Gesamt!A$4:A$1000,Gesamt!F$4:F$1000)","v":0},{"$f":"LOOKUP(A66,Gesamt!A$4:A$1000,Gesamt!G$4:G$1000)","v":0},{"$f":"LOOKUP(A66,Gesamt!A$4:A$1000,Gesamt!H$4:H$1000)","v":0},{"$f":"LOOKUP(A66,Gesamt!A$4:A$1000,Gesamt!I$4:I$1000)","v":0},{"$f":"LOOKUP(A66,Gesamt!A$4:A$1000,Gesamt!J$4:J$1000)","v":0},{"$f":"LOOKUP(A66,Gesamt!A$4:A$1000,Gesamt!K$4:K$1000)","v":0},{"$f":"LOOKUP(A66,Gesamt!A$4:A$1000,Gesamt!L$4:L$1000)","v":0},{"$f":"LOOKUP(A66,Gesamt!A$4:A$1000,Gesamt!M$4:M$1000)","v":0},{"$f":"IF(M66>0,M66*-1,-1000)","v":-1000},{"$f":"IF(M66>0,RANK(N66,N:N),0)","v":0}]
[759,{"$f":"LOOKUP(A67,Gesamt!A$4:A$1000,Gesamt!B$4:B$1000)","v":0},{"$f":"LOOKUP(A67,Gesamt!A$4:A$1000,Gesamt!C$4:C$1000)","v":0},{"$f":"LOOKUP(A67,Gesamt!A$4:A$1000,Gesamt!D$4:D$1000)","v":0},{"$f":"LOOKUP(A67,Gesamt!A$4:A$1000,Gesamt!E$4:E$1000)","v":0},{"$f":"LOOKUP(A67,Gesamt!A$4:A$1000,Gesamt!F$4:F$1000)","v":0},{"$f":"LOOKUP(A67,Gesamt!A$4:A$1000,Gesamt!G$4:G$1000)","v":0},{"$f":"LOOKUP(A67,Gesamt!A$4:A$1000,Gesamt!H$4:H$1000)","v":0},{"$f":"LOOKUP(A67,Gesamt!A$4:A$1000,Gesamt!I$4:I$1000)","v":0},{"$f":"LOOKUP(A67,Gesamt!A$4:A$1000,Gesamt!J$4:J$1000)","v":0},{"$f":"LOOKUP(A67,Gesamt!A$4:A$1000,Gesamt!K$4:K$1000)","v":0},{"$f":"LOOKUP(A67,Gesamt!A$4:A$1000,Gesamt!L$4:L$1000)","v":0},{"$f":"LOOKUP(A67,Gesamt!A$4:A$1000,Gesamt!M$4:M$1000)","v":0},{"$f":"IF(M67>0,M67*-1,-1000)","v":-1000},{"$f":"IF(M67>0,RANK(N67,N:N),0)","v":0}]
[760,{"$f":"LOOKUP(A68,Gesamt!A$4:A$1000,Gesamt!B$4:B$1000)","v":0},{"$f":"LOOKUP(A68,Gesamt!A$4:A$1000,Gesamt!C$4:C$1000)","v":0},{"$f":"LOOKUP(A68,Gesamt!A$4:A$1000,Gesamt!D$4:D$1000)","v":0},{"$f":"LOOKUP(A68,Gesamt!A$4:A$1000,Gesamt!E$4:E$1000)","v":0},{"$f":"LOOKUP(A68,Gesamt!A$4:A$1000,Gesamt!F$4:F$1000)","v":0},{"$f":"LOOKUP(A68,Gesamt!A$4:A$1000,Gesamt!G$4:G$1000)","v":0},{"$f":"LOOKUP(A68,Gesamt!A$4:A$1000,Gesamt!H$4:H$1000)","v":0},{"$f":"LOOKUP(A68,Gesamt!A$4:A$1000,Gesamt!I$4:I$1000)","v":0},{"$f":"LOOKUP(A68,Gesamt!A$4:A$1000,Gesamt!J$4:J$1000)","v":0},{"$f":"LOOKUP(A68,Gesamt!A$4:A$1000,Gesamt!K$4:K$1000)","v":0},{"$f":"LOOKUP(A68,Gesamt!A$4:A$1000,Gesamt!L$4:L$1000)","v":0},{"$f":"LOOKUP(A68,Gesamt!A$4:A$1000,Gesamt!M$4:M$1000)","v":0},{"$f":"IF(M68>0,M68*-1,-1000)","v":-1000},{"$f":"IF(M68>0,RANK(N68,N:N),0)","v":0}]
[761,{"$f":"LOOKUP(A69,Gesamt!A$4:A$1000,Gesamt!B$4:B$1000)","v":0},{"$f":"LOOKUP(A69,Gesamt!A$4:A$1000,Gesamt!C$4:C$1000)","v":0},{"$f":"LOOKUP(A69,Gesamt!A$4:A$1000,Gesamt!D$4:D$1000)","v":0},{"$f":"LOOKUP(A69,Gesamt!A$4:A$1000,Gesamt!E$4:E$1000)","v":0},{"$f":"LOOKUP(A69,Gesamt!A$4:A$1000,Gesamt!F$4:F$1000)","v":0},{"$f":"LOOKUP(A69,Gesamt!A$4:A$1000,Gesamt!G$4:G$1000)","v":0},{"$f":"LOOKUP(A69,Gesamt!A$4:A$1000,Gesamt!H$4:H$1000)","v":0},{"$f":"LOOKUP(A69,Gesamt!A$4:A$1000,Gesamt!I$4:I$1000)","v":0},{"$f":"LOOKUP(A69,Gesamt!A$4:A$1000,Gesamt!J$4:J$1000)","v":0},{"$f":"LOOKUP(A69,Gesamt!A$4:A$1000,Gesamt!K$4:K$1000)","v":0},{"$f":"LOOKUP(A69,Gesamt!A$4:A$1000,Gesamt!L$4:L$1000)","v":0},{"$f":"LOOKUP(A69,Gesamt!A$4:A$1000,Gesamt!M$4:M$1000)","v":0},{"$f":"IF(M69>0,M69*-1,-1000)","v":-1000},{"$f":"IF(M69>0,RANK(N69,N:N),0)","v":0}]
[762,{"$f":"LOOKUP(A70,Gesamt!A$4:A$1000,Gesamt!B$4:B$1000)","v":0},{"$f":"LOOKUP(A70,Gesamt!A$4:A$1000,Gesamt!C$4:C$1000)","v":0},{"$f":"LOOKUP(A70,Gesamt!A$4:A$1000,Gesamt!D$4:D$1000)","v":0},{"$f":"LOOKUP(A70,Gesamt!A$4:A$1000,Gesamt!E$4:E$1000)","v":0},{"$f":"LOOKUP(A70,Gesamt!A$4:A$1000,Gesamt!F$4:F$1000)","v":0},{"$f":"LOOKUP(A70,Gesamt!A$4:A$1000,Gesamt!G$4:G$1000)","v":0},{"$f":"LOOKUP(A70,Gesamt!A$4:A$1000,Gesamt!H$4:H$1000)","v":0},{"$f":"LOOKUP(A70,Gesamt!A$4:A$1000,Gesamt!I$4:I$1000)","v":0},{"$f":"LOOKUP(A70,Gesamt!A$4:A$1000,Gesamt!J$4:J$1000)","v":0},{"$f":"LOOKUP(A70,Gesamt!A$4:A$1000,Gesamt!K$4:K$1000)","v":0},{"$f":"LOOKUP(A70,Gesamt!A$4:A$1000,Gesamt!L$4:L$1000)","v":0},{"$f":"LOOKUP(A70,Gesamt!A$4:A$1000,Gesamt!M$4:M$1000)","v":0},{"$f":"IF(M70>0,M70*-1,-1000)","v":-1000},{"$f":"IF(M70>0,RANK(N70,N:N),0)","v":0}]
[763,{"$f":"LOOKUP(A71,Gesamt!A$4:A$1000,Gesamt!B$4:B$1000)","v":0},{"$f":"LOOKUP(A71,Gesamt!A$4:A$1000,Gesamt!C$4:C$1000)","v":0},{"$f":"LOOKUP(A71,Gesamt!A$4:A$1000,Gesamt!D$4:D$1000)","v":0},{"$f":"LOOKUP(A71,Gesamt!A$4:A$1000,Gesamt!E$4:E$1000)","v":0},{"$f":"LOOKUP(A71,Gesamt!A$4:A$1000,Gesamt!F$4:F$1000)","v":0},{"$f":"LOOKUP(A71,Gesamt!A$4:A$1000,Gesamt!G$4:G$1000)","v":0},{"$f":"LOOKUP(A71,Gesamt!A$4:A$1000,Gesamt!H$4:H$1000)","v":0},{"$f":"LOOKUP(A71,Gesamt!A$4:A$1000,Gesamt!I$4:I$1000)","v":0},{"$f":"LOOKUP(A71,Gesamt!A$4:A$1000,Gesamt!J$4:J$1000)","v":0},{"$f":"LOOKUP(A71,Gesamt!A$4:A$1000,Gesamt!K$4:K$1000)","v":0},{"$f":"LOOKUP(A71,Gesamt!A$4:A$1000,Gesamt!L$4:L$1000)","v":0},{"$f":"LOOKUP(A71,Gesamt!A$4:A$1000,Gesamt!M$4:M$1000)","v":0},{"$f":"IF(M71>0,M71*-1,-1000)","v":-1000},{"$f":"IF(M71>0,RANK(N71,N:N),0)","v":0}]
[764,{"$f":"LOOKUP(A72,Gesamt!A$4:A$1000,Gesamt!B$4:B$1000)","v":0},{"$f":"LOOKUP(A72,Gesamt!A$4:A$1000,Gesamt!C$4:C$1000)","v":0},{"$f":"LOOKUP(A72,Gesamt!A$4:A$1000,Gesamt!D$4:D$1000)","v":0},{"$f":"LOOKUP(A72,Gesamt!A$4:A$1000,Gesamt!E$4:E$1000)","v":0},{"$f":"LOOKUP(A72,Gesamt!A$4:A$1000,Gesamt!F$4:F$1000)","v":0},{"$f":"LOOKUP(A72,Gesamt!A$4:A$1000,Gesamt!G$4:G$1000)","v":0},{"$f":"LOOKUP(A72,Gesamt!A$4:A$1000,Gesamt!H$4:H$1000)","v":0},{"$f":"LOOKUP(A72,Gesamt!A$4:A$1000,Gesamt!I$4:I$1000)","v":0},{"$f":"LOOKUP(A72,Gesamt!A$4:A$1000,Gesamt!J$4:J$1000)","v":0},{"$f":"LOOKUP(A72,Gesamt!A$4:A$1000,Gesamt!K$4:K$1000)","v":0},{"$f":"LOOKUP(A72,Gesamt!A$4:A$1000,Gesamt!L$4:L$1000)","v":0},{"$f":"LOOKUP(A72,Gesamt!A$4:A$1000,Gesamt!M$4:M$1000)","v":0},{"$f":"IF(M72>0,M72*-1,-1000)","v":-1000},{"$f":"IF(M72>0,RANK(N72,N:N),0)","v":0}]
[765,{"$f":"LOOKUP(A73,Gesamt!A$4:A$1000,Gesamt!B$4:B$1000)","v":0},{"$f":"LOOKUP(A73,Gesamt!A$4:A$1000,Gesamt!C$4:C$1000)","v":0},{"$f":"LOOKUP(A73,Gesamt!A$4:A$1000,Gesamt!D$4:D$1000)","v":0},{"$f":"LOOKUP(A73,Gesamt!A$4:A$1000,Gesamt!E$4:E$1000)","v":0},{"$f":"LOOKUP(A73,Gesamt!A$4:A$1000,Gesamt!F$4:F$1000)","v":0},{"$f":"LOOKUP(A73,Gesamt!A$4:A$1000,Gesamt!G$4:G$1000)","v":0},{"$f":"LOOKUP(A73,Gesamt!A$4:A$1000,Gesamt!H$4:H$1000)","v":0},{"$f":"LOOKUP(A73,Gesamt!A$4:A$1000,Gesamt!I$4:I$1000)","v":0},{"$f":"LOOKUP(A73,Gesamt!A$4:A$1000,Gesamt!J$4:J$1000)","v":0},{"$f":"LOOKUP(A73,Gesamt!A$4:A$1000,Gesamt!K$4:K$1000)","v":0},{"$f":"LOOKUP(A73,Gesamt!A$4:A$1000,Gesamt!L$4:L$1000)","v":0},{"$f":"LOOKUP(A73,Gesamt!A$4:A$1000,Gesamt!M$4:M$1000)","v":0},{"$f":"IF(M73>0,M73*-1,-1000)","v":-1000},{"$f":"IF(M73>0,RANK(N73,N:N),0)","v":0}]
[766,{"$f":"LOOKUP(A74,Gesamt!A$4:A$1000,Gesamt!B$4:B$1000)","v":0},{"$f":"LOOKUP(A74,Gesamt!A$4:A$1000,Gesamt!C$4:C$1000)","v":0},{"$f":"LOOKUP(A74,Gesamt!A$4:A$1000,Gesamt!D$4:D$1000)","v":0},{"$f":"LOOKUP(A74,Gesamt!A$4:A$1000,Gesamt!E$4:E$1000)","v":0},{"$f":"LOOKUP(A74,Gesamt!A$4:A$1000,Gesamt!F$4:F$1000)","v":0},{"$f":"LOOKUP(A74,Gesamt!A$4:A$1000,Gesamt!G$4:G$1000)","v":0},{"$f":"LOOKUP(A74,Gesamt!A$4:A$1000,Gesamt!H$4:H$1000)","v":0},{"$f":"LOOKUP(A74,Gesamt!A$4:A$1000,Gesamt!I$4:I$1000)","v":0},{"$f":"LOOKUP(A74,Gesamt!A$4:A$1000,Gesamt!J$4:J$1000)","v":0},{"$f":"LOOKUP(A74,Gesamt!A$4:A$1000,Gesamt!K$4:K$1000)","v":0},{"$f":"LOOKUP(A74,Gesamt!A$4:A$1000,Gesamt!L$4:L$1000)","v":0},{"$f":"LOOKUP(A74,Gesamt!A$4:A$1000,Gesamt!M$4:M$1000)","v":0},{"$f":"IF(M74>0,M74*-1,-1000)","v":-1000},{"$f":"IF(M74>0,RANK(N74,N:N),0)","v":0}]
[767,{"$f":"LOOKUP(A75,Gesamt!A$4:A$1000,Gesamt!B$4:B$1000)","v":0},{"$f":"LOOKUP(A75,Gesamt!A$4:A$1000,Gesamt!C$4:C$1000)","v":0},{"$f":"LOOKUP(A75,Gesamt!A$4:A$1000,Gesamt!D$4:D$1000)","v":0},{"$f":"LOOKUP(A75,Gesamt!A$4:A$1000,Gesamt!E$4:E$1000)","v":0},{"$f":"LOOKUP(A75,Gesamt!A$4:A$1000,Gesamt!F$4:F$1000)","v":0},{"$f":"LOOKUP(A75,Gesamt!A$4:A$1000,Gesamt!G$4:G$1000)","v":0},{"$f":"LOOKUP(A75,Gesamt!A$4:A$1000,Gesamt!H$4:H$1000)","v":0},{"$f":"LOOKUP(A75,Gesamt!A$4:A$1000,Gesamt!I$4:I$1000)","v":0},{"$f":"LOOKUP(A75,Gesamt!A$4:A$1000,Gesamt!J$4:J$1000)","v":0},{"$f":"LOOKUP(A75,Gesamt!A$4:A$1000,Gesamt!K$4:K$1000)","v":0},{"$f":"LOOKUP(A75,Gesamt!A$4:A$1000,Gesamt!L$4:L$1000)","v":0},{"$f":"LOOKUP(A75,Gesamt!A$4:A$1000,Gesamt!M$4:M$1000)","v":0},{"$f":"IF(M75>0,M75*-1,-1000)","v":-1000},{"$f":"IF(M75>0,RANK(N75,N:N),0)","v":0}]
[768,{"$f":"LOOKUP(A76,Gesamt!A$4:A$1000,Gesamt!B$4:B$1000)","v":0},{"$f":"LOOKUP(A76,Gesamt!A$4:A$1000,Gesamt!C$4:C$1000)","v":0},{"$f":"LOOKUP(A76,Gesamt!A$4:A$1000,Gesamt!D$4:D$1000)","v":0},{"$f":"LOOKUP(A76,Gesamt!A$4:A$1000,Gesamt!E$4:E$1000)","v":0},{"$f":"LOOKUP(A76,Gesamt!A$4:A$1000,Gesamt!F$4:F$1000)","v":0},{"$f":"LOOKUP(A76,Gesamt!A$4:A$1000,Gesamt!G$4:G$1000)","v":0},{"$f":"LOOKUP(A76,Gesamt!A$4:A$1000,Gesamt!H$4:H$1000)","v":0},{"$f":"LOOKUP(A76,Gesamt!A$4:A$1000,Gesamt!I$4:I$1000)","v":0},{"$f":"LOOKUP(A76,Gesamt!A$4:A$1000,Gesamt!J$4:J$1000)","v":0},{"$f":"LOOKUP(A76,Gesamt!A$4:A$1000,Gesamt!K$4:K$1000)","v":0},{"$f":"LOOKUP(A76,Gesamt!A$4:A$1000,Gesamt!L$4:L$1000)","v":0},{"$f":"LOOKUP(A76,Gesamt!A$4:A$1000,Gesamt!M$4:M$1000)","v":0},{"$f":"IF(M76>0,M76*-1,-1000)","v":-1000},{"$f":"IF(M76>0,RANK(N76,N:N),0)","v":0}]
[769,{"$f":"LOOKUP(A77,Gesamt!A$4:A$1000,Gesamt!B$4:B$1000)","v":0},{"$f":"LOOKUP(A77,Gesamt!A$4:A$1000,Gesamt!C$4:C$1000)","v":0},{"$f":"LOOKUP(A77,Gesamt!A$4:A$1000,Gesamt!D$4:D$1000)","v":0},{"$f":"LOOKUP(A77,Gesamt!A$4:A$1000,Gesamt!E$4:E$1000)","v":0},{"$f":"LOOKUP(A77,Gesamt!A$4:A$1000,Gesamt!F$4:F$1000)","v":0},{"$f":"LOOKUP(A77,Gesamt!A$4:A$1000,Gesamt!G$4:G$1000)","v":0},{"$f":"LOOKUP(A77,Gesamt!A$4:A$1000,Gesamt!H$4:H$1000)","v":0},{"$f":"LOOKUP(A77,Gesamt!A$4:A$1000,Gesamt!I$4:I$1000)","v":0},{"$f":"LOOKUP(A77,Gesamt!A$4:A$1000,Gesamt!J$4:J$1000)","v":0},{"$f":"LOOKUP(A77,Gesamt!A$4:A$1000,Gesamt!K$4:K$1000)","v":0},{"$f":"LOOKUP(A77,Gesamt!A$4:A$1000,Gesamt!L$4:L$1000)","v":0},{"$f":"LOOKUP(A77,Gesamt!A$4:A$1000,Gesamt!M$4:M$1000)","v":0},{"$f":"IF(M77>0,M77*-1,-1000)","v":-1000},{"$f":"IF(M77>0,RANK(N77,N:N),0)","v":0}]
[770,{"$f":"LOOKUP(A78,Gesamt!A$4:A$1000,Gesamt!B$4:B$1000)","v":0},{"$f":"LOOKUP(A78,Gesamt!A$4:A$1000,Gesamt!C$4:C$1000)","v":0},{"$f":"LOOKUP(A78,Gesamt!A$4:A$1000,Gesamt!D$4:D$1000)","v":0},{"$f":"LOOKUP(A78,Gesamt!A$4:A$1000,Gesamt!E$4:E$1000)","v":0},{"$f":"LOOKUP(A78,Gesamt!A$4:A$1000,Gesamt!F$4:F$1000)","v":0},{"$f":"LOOKUP(A78,Gesamt!A$4:A$1000,Gesamt!G$4:G$1000)","v":0},{"$f":"LOOKUP(A78,Gesamt!A$4:A$1000,Gesamt!H$4:H$1000)","v":0},{"$f":"LOOKUP(A78,Gesamt!A$4:A$1000,Gesamt!I$4:I$1000)","v":0},{"$f":"LOOKUP(A78,Gesamt!A$4:A$1000,Gesamt!J$4:J$1000)","v":0},{"$f":"LOOKUP(A78,Gesamt!A$4:A$1000,Gesamt!K$4:K$1000)","v":0},{"$f":"LOOKUP(A78,Gesamt!A$4:A$1000,Gesamt!L$4:L$1000)","v":0},{"$f":"LOOKUP(A78,Gesamt!A$4:A$1000,Gesamt!M$4:M$1000)","v":0},{"$f":"IF(M78>0,M78*-1,-1000)","v":-1000},{"$f":"IF(M78>0,RANK(N78,N:N),0)","v":0}]
[771,{"$f":"LOOKUP(A79,Gesamt!A$4:A$1000,Gesamt!B$4:B$1000)","v":0},{"$f":"LOOKUP(A79,Gesamt!A$4:A$1000,Gesamt!C$4:C$1000)","v":0},{"$f":"LOOKUP(A79,Gesamt!A$4:A$1000,Gesamt!D$4:D$1000)","v":0},{"$f":"LOOKUP(A79,Gesamt!A$4:A$1000,Gesamt!E$4:E$1000)","v":0},{"$f":"LOOKUP(A79,Gesamt!A$4:A$1000,Gesamt!F$4:F$1000)","v":0},{"$f":"LOOKUP(A79,Gesamt!A$4:A$1000,Gesamt!G$4:G$1000)","v":0},{"$f":"LOOKUP(A79,Gesamt!A$4:A$1000,Gesamt!H$4:H$1000)","v":0},{"$f":"LOOKUP(A79,Gesamt!A$4:A$1000,Gesamt!I$4:I$1000)","v":0},{"$f":"LOOKUP(A79,Gesamt!A$4:A$1000,Gesamt!J$4:J$1000)","v":0},{"$f":"LOOKUP(A79,Gesamt!A$4:A$1000,Gesamt!K$4:K$1000)","v":0},{"$f":"LOOKUP(A79,Gesamt!A$4:A$1000,Gesamt!L$4:L$1000)","v":0},{"$f":"LOOKUP(A79,Gesamt!A$4:A$1000,Gesamt!M$4:M$1000)","v":0},{"$f":"IF(M79>0,M79*-1,-1000)","v":-1000},{"$f":"IF(M79>0,RANK(N79,N:N),0)","v":0}]
[772,{"$f":"LOOKUP(A80,Gesamt!A$4:A$1000,Gesamt!B$4:B$1000)","v":0},{"$f":"LOOKUP(A80,Gesamt!A$4:A$1000,Gesamt!C$4:C$1000)","v":0},{"$f":"LOOKUP(A80,Gesamt!A$4:A$1000,Gesamt!D$4:D$1000)","v":0},{"$f":"LOOKUP(A80,Gesamt!A$4:A$1000,Gesamt!E$4:E$1000)","v":0},{"$f":"LOOKUP(A80,Gesamt!A$4:A$1000,Gesamt!F$4:F$1000)","v":0},{"$f":"LOOKUP(A80,Gesamt!A$4:A$1000,Gesamt!G$4:G$1000)","v":0},{"$f":"LOOKUP(A80,Gesamt!A$4:A$1000,Gesamt!H$4:H$1000)","v":0},{"$f":"LOOKUP(A80,Gesamt!A$4:A$1000,Gesamt!I$4:I$1000)","v":0},{"$f":"LOOKUP(A80,Gesamt!A$4:A$1000,Gesamt!J$4:J$1000)","v":0},{"$f":"LOOKUP(A80,Gesamt!A$4:A$1000,Gesamt!K$4:K$1000)","v":0},{"$f":"LOOKUP(A80,Gesamt!A$4:A$1000,Gesamt!L$4:L$1000)","v":0},{"$f":"LOOKUP(A80,Gesamt!A$4:A$1000,Gesamt!M$4:M$1000)","v":0},{"$f":"IF(M80>0,M80*-1,-1000)","v":-1000},{"$f":"IF(M80>0,RANK(N80,N:N),0)","v":0}]
[773,{"$f":"LOOKUP(A81,Gesamt!A$4:A$1000,Gesamt!B$4:B$1000)","v":0},{"$f":"LOOKUP(A81,Gesamt!A$4:A$1000,Gesamt!C$4:C$1000)","v":0},{"$f":"LOOKUP(A81,Gesamt!A$4:A$1000,Gesamt!D$4:D$1000)","v":0},{"$f":"LOOKUP(A81,Gesamt!A$4:A$1000,Gesamt!E$4:E$1000)","v":0},{"$f":"LOOKUP(A81,Gesamt!A$4:A$1000,Gesamt!F$4:F$1000)","v":0},{"$f":"LOOKUP(A81,Gesamt!A$4:A$1000,Gesamt!G$4:G$1000)","v":0},{"$f":"LOOKUP(A81,Gesamt!A$4:A$1000,Gesamt!H$4:H$1000)","v":0},{"$f":"LOOKUP(A81,Gesamt!A$4:A$1000,Gesamt!I$4:I$1000)","v":0},{"$f":"LOOKUP(A81,Gesamt!A$4:A$1000,Gesamt!J$4:J$1000)","v":0},{"$f":"LOOKUP(A81,Gesamt!A$4:A$1000,Gesamt!K$4:K$1000)","v":0},{"$f":"LOOKUP(A81,Gesamt!A$4:A$1000,Gesamt!L$4:L$1000)","v":0},{"$f":"LOOKUP(A81,Gesamt!A$4:A$1000,Gesamt!M$4:M$1000)","v":0},{"$f":"IF(M81>0,M81*-1,-1000)","v":-1000},{"$f":"IF(M81>0,RANK(N81,N:N),0)","v":0}]
[774,{"$f":"LOOKUP(A82,Gesamt!A$4:A$1000,Gesamt!B$4:B$1000)","v":0},{"$f":"LOOKUP(A82,Gesamt!A$4:A$1000,Gesamt!C$4:C$1000)","v":0},{"$f":"LOOKUP(A82,Gesamt!A$4:A$1000,Gesamt!D$4:D$1000)","v":0},{"$f":"LOOKUP(A82,Gesamt!A$4:A$1000,Gesamt!E$4:E$1000)","v":0},{"$f":"LOOKUP(A82,Gesamt!A$4:A$1000,Gesamt!F$4:F$1000)","v":0},{"$f":"LOOKUP(A82,Gesamt!A$4:A$1000,Gesamt!G$4:G$1000)","v":0},{"$f":"LOOKUP(A82,Gesamt!A$4:A$1000,Gesamt!H$4:H$1000)","v":0},{"$f":"LOOKUP(A82,Gesamt!A$4:A$1000,Gesamt!I$4:I$1000)","v":0},{"$f":"LOOKUP(A82,Gesamt!A$4:A$1000,Gesamt!J$4:J$1000)","v":0},{"$f":"LOOKUP(A82,Gesamt!A$4:A$1000,Gesamt!K$4:K$1000)","v":0},{"$f":"LOOKUP(A82,Gesamt!A$4:A$1000,Gesamt!L$4:L$1000)","v":0},{"$f":"LOOKUP(A82,Gesamt!A$4:A$1000,Gesamt!M$4:M$1000)","v":0},{"$f":"IF(M82>0,M82*-1,-1000)","v":-1000},{"$f":"IF(M82>0,RANK(N82,N:N),0)","v":0}]
[775,{"$f":"LOOKUP(A83,Gesamt!A$4:A$1000,Gesamt!B$4:B$1000)","v":0},{"$f":"LOOKUP(A83,Gesamt!A$4:A$1000,Gesamt!C$4:C$1000)","v":0},{"$f":"LOOKUP(A83,Gesamt!A$4:A$1000,Gesamt!D$4:D$1000)","v":0},{"$f":"LOOKUP(A83,Gesamt!A$4:A$1000,Gesamt!E$4:E$1000)","v":0},{"$f":"LOOKUP(A83,Gesamt!A$4:A$1000,Gesamt!F$4:F$1000)","v":0},{"$f":"LOOKUP(A83,Gesamt!A$4:A$1000,Gesamt!G$4:G$1000)","v":0},{"$f":"LOOKUP(A83,Gesamt!A$4:A$1000,Gesamt!H$4:H$1000)","v":0},{"$f":"LOOKUP(A83,Gesamt!A$4:A$1000,Gesamt!I$4:I$1000)","v":0},{"$f":"LOOKUP(A83,Gesamt!A$4:A$1000,Gesamt!J$4:J$1000)","v":0},{"$f":"LOOKUP(A83,Gesamt!A$4:A$1000,Gesamt!K$4:K$1000)","v":0},{"$f":"LOOKUP(A83,Gesamt!A$4:A$1000,Gesamt!L$4:L$1000)","v":0},{"$f":"LOOKUP(A83,Gesamt!A$4:A$1000,Gesamt!M$4:M$1000)","v":0},{"$f":"IF(M83>0,M83*-1,-1000)","v":-1000},{"$f":"IF(M83>0,RANK(N83,N:N),0)","v":0}]
[776,{"$f":"LOOKUP(A84,Gesamt!A$4:A$1000,Gesamt!B$4:B$1000)","v":0},{"$f":"LOOKUP(A84,Gesamt!A$4:A$1000,Gesamt!C$4:C$1000)","v":0},{"$f":"LOOKUP(A84,Gesamt!A$4:A$1000,Gesamt!D$4:D$1000)","v":0},{"$f":"LOOKUP(A84,Gesamt!A$4:A$1000,Gesamt!E$4:E$1000)","v":0},{"$f":"LOOKUP(A84,Gesamt!A$4:A$1000,Gesamt!F$4:F$1000)","v":0},{"$f":"LOOKUP(A84,Gesamt!A$4:A$1000,Gesamt!G$4:G$1000)","v":0},{"$f":"LOOKUP(A84,Gesamt!A$4:A$1000,Gesamt!H$4:H$1000)","v":0},{"$f":"LOOKUP(A84,Gesamt!A$4:A$1000,Gesamt!I$4:I$1000)","v":0},{"$f":"LOOKUP(A84,Gesamt!A$4:A$1000,Gesamt!J$4:J$1000)","v":0},{"$f":"LOOKUP(A84,Gesamt!A$4:A$1000,Gesamt!K$4:K$1000)","v":0},{"$f":"LOOKUP(A84,Gesamt!A$4:A$1000,Gesamt!L$4:L$1000)","v":0},{"$f":"LOOKUP(A84,Gesamt!A$4:A$1000,Gesamt!M$4:M$1000)","v":0},{"$f":"IF(M84>0,M84*-1,-1000)","v":-1000},{"$f":"IF(M84>0,RANK(N84,N:N),0)","v":0}]
[777,{"$f":"LOOKUP(A85,Gesamt!A$4:A$1000,Gesamt!B$4:B$1000)","v":0},{"$f":"LOOKUP(A85,Gesamt!A$4:A$1000,Gesamt!C$4:C$1000)","v":0},{"$f":"LOOKUP(A85,Gesamt!A$4:A$1000,Gesamt!D$4:D$1000)","v":0},{"$f":"LOOKUP(A85,Gesamt!A$4:A$1000,Gesamt!E$4:E$1000)","v":0},{"$f":"LOOKUP(A85,Gesamt!A$4:A$1000,Gesamt!F$4:F$1000)","v":0},{"$f":"LOOKUP(A85,Gesamt!A$4:A$1000,Gesamt!G$4:G$1000)","v":0},{"$f":"LOOKUP(A85,Gesamt!A$4:A$1000,Gesamt!H$4:H$1000)","v":0},{"$f":"LOOKUP(A85,Gesamt!A$4:A$1000,Gesamt!I$4:I$1000)","v":0},{"$f":"LOOKUP(A85,Gesamt!A$4:A$1000,Gesamt!J$4:J$1000)","v":0},{"$f":"LOOKUP(A85,Gesamt!A$4:A$1000,Gesamt!K$4:K$1000)","v":0},{"$f":"LOOKUP(A85,Gesamt!A$4:A$1000,Gesamt!L$4:L$1000)","v":0},{"$f":"LOOKUP(A85,Gesamt!A$4:A$1000,Gesamt!M$4:M$1000)","v":0},{"$f":"IF(M85>0,M85*-1,-1000)","v":-1000},{"$f":"IF(M85>0,RANK(N85,N:N),0)","v":0}]
[778,{"$f":"LOOKUP(A86,Gesamt!A$4:A$1000,Gesamt!B$4:B$1000)","v":0},{"$f":"LOOKUP(A86,Gesamt!A$4:A$1000,Gesamt!C$4:C$1000)","v":0},{"$f":"LOOKUP(A86,Gesamt!A$4:A$1000,Gesamt!D$4:D$1000)","v":0},{"$f":"LOOKUP(A86,Gesamt!A$4:A$1000,Gesamt!E$4:E$1000)","v":0},{"$f":"LOOKUP(A86,Gesamt!A$4:A$1000,Gesamt!F$4:F$1000)","v":0},{"$f":"LOOKUP(A86,Gesamt!A$4:A$1000,Gesamt!G$4:G$1000)","v":0},{"$f":"LOOKUP(A86,Gesamt!A$4:A$1000,Gesamt!H$4:H$1000)","v":0},{"$f":"LOOKUP(A86,Gesamt!A$4:A$1000,Gesamt!I$4:I$1000)","v":0},{"$f":"LOOKUP(A86,Gesamt!A$4:A$1000,Gesamt!J$4:J$1000)","v":0},{"$f":"LOOKUP(A86,Gesamt!A$4:A$1000,Gesamt!K$4:K$1000)","v":0},{"$f":"LOOKUP(A86,Gesamt!A$4:A$1000,Gesamt!L$4:L$1000)","v":0},{"$f":"LOOKUP(A86,Gesamt!A$4:A$1000,Gesamt!M$4:M$1000)","v":0},{"$f":"IF(M86>0,M86*-1,-1000)","v":-1000},{"$f":"IF(M86>0,RANK(N86,N:N),0)","v":0}]
[779,{"$f":"LOOKUP(A87,Gesamt!A$4:A$1000,Gesamt!B$4:B$1000)","v":0},{"$f":"LOOKUP(A87,Gesamt!A$4:A$1000,Gesamt!C$4:C$1000)","v":0},{"$f":"LOOKUP(A87,Gesamt!A$4:A$1000,Gesamt!D$4:D$1000)","v":0},{"$f":"LOOKUP(A87,Gesamt!A$4:A$1000,Gesamt!E$4:E$1000)","v":0},{"$f":"LOOKUP(A87,Gesamt!A$4:A$1000,Gesamt!F$4:F$1000)","v":0},{"$f":"LOOKUP(A87,Gesamt!A$4:A$1000,Gesamt!G$4:G$1000)","v":0},{"$f":"LOOKUP(A87,Gesamt!A$4:A$1000,Gesamt!H$4:H$1000)","v":0},{"$f":"LOOKUP(A87,Gesamt!A$4:A$1000,Gesamt!I$4:I$1000)","v":0},{"$f":"LOOKUP(A87,Gesamt!A$4:A$1000,Gesamt!J$4:J$1000)","v":0},{"$f":"LOOKUP(A87,Gesamt!A$4:A$1000,Gesamt!K$4:K$1000)","v":0},{"$f":"LOOKUP(A87,Gesamt!A$4:A$1000,Gesamt!L$4:L$1000)","v":0},{"$f":"LOOKUP(A87,Gesamt!A$4:A$1000,Gesamt!M$4:M$1000)","v":0},{"$f":"IF(M87>0,M87*-1,-1000)","v":-1000},{"$f":"IF(M87>0,RANK(N87,N:N),0)","v":0}]
[780,{"$f":"LOOKUP(A88,Gesamt!A$4:A$1000,Gesamt!B$4:B$1000)","v":0},{"$f":"LOOKUP(A88,Gesamt!A$4:A$1000,Gesamt!C$4:C$1000)","v":0},{"$f":"LOOKUP(A88,Gesamt!A$4:A$1000,Gesamt!D$4:D$1000)","v":0},{"$f":"LOOKUP(A88,Gesamt!A$4:A$1000,Gesamt!E$4:E$1000)","v":0},{"$f":"LOOKUP(A88,Gesamt!A$4:A$1000,Gesamt!F$4:F$1000)","v":0},{"$f":"LOOKUP(A88,Gesamt!A$4:A$1000,Gesamt!G$4:G$1000)","v":0},{"$f":"LOOKUP(A88,Gesamt!A$4:A$1000,Gesamt!H$4:H$1000)","v":0},{"$f":"LOOKUP(A88,Gesamt!A$4:A$1000,Gesamt!I$4:I$1000)","v":0},{"$f":"LOOKUP(A88,Gesamt!A$4:A$1000,Gesamt!J$4:J$1000)","v":0},{"$f":"LOOKUP(A88,Gesamt!A$4:A$1000,Gesamt!K$4:K$1000)","v":0},{"$f":"LOOKUP(A88,Gesamt!A$4:A$1000,Gesamt!L$4:L$1000)","v":0},{"$f":"LOOKUP(A88,Gesamt!A$4:A$1000,Gesamt!M$4:M$1000)","v":0},{"$f":"IF(M88>0,M88*-1,-1000)","v":-1000},{"$f":"IF(M88>0,RANK(N88,N:N),0)","v":0}]
[781,{"$f":"LOOKUP(A89,Gesamt!A$4:A$1000,Gesamt!B$4:B$1000)","v":0},{"$f":"LOOKUP(A89,Gesamt!A$4:A$1000,Gesamt!C$4:C$1000)","v":0},{"$f":"LOOKUP(A89,Gesamt!A$4:A$1000,Gesamt!D$4:D$1000)","v":0},{"$f":"LOOKUP(A89,Gesamt!A$4:A$1000,Gesamt!E$4:E$1000)","v":0},{"$f":"LOOKUP(A89,Gesamt!A$4:A$1000,Gesamt!F$4:F$1000)","v":0},{"$f":"LOOKUP(A89,Gesamt!A$4:A$1000,Gesamt!G$4:G$1000)","v":0},{"$f":"LOOKUP(A89,Gesamt!A$4:A$1000,Gesamt!H$4:H$1000)","v":0},{"$f":"LOOKUP(A89,Gesamt!A$4:A$1000,Gesamt!I$4:I$1000)","v":0},{"$f":"LOOKUP(A89,Gesamt!A$4:A$1000,Gesamt!J$4:J$1000)","v":0},{"$f":"LOOKUP(A89,Gesamt!A$4:A$1000,Gesamt!K$4:K$1000)","v":0},{"$f":"LOOKUP(A89,Gesamt!A$4:A$1000,Gesamt!L$4:L$1000)","v":0},{"$f":"LOOKUP(A89,Gesamt!A$4:A$1000,Gesamt!M$4:M$1000)","v":0},{"$f":"IF(M89>0,M89*-1,-1000)","v":-1000},{"$f":"IF(M89>0,RANK(N89,N:N),0)","v":0}]
[782,{"$f":"LOOKUP(A90,Gesamt!A$4:A$1000,Gesamt!B$4:B$1000)","v":0},{"$f":"LOOKUP(A90,Gesamt!A$4:A$1000,Gesamt!C$4:C$1000)","v":0},{"$f":"LOOKUP(A90,Gesamt!A$4:A$1000,Gesamt!D$4:D$1000)","v":0},{"$f":"LOOKUP(A90,Gesamt!A$4:A$1000,Gesamt!E$4:E$1000)","v":0},{"$f":"LOOKUP(A90,Gesamt!A$4:A$1000,Gesamt!F$4:F$1000)","v":0},{"$f":"LOOKUP(A90,Gesamt!A$4:A$1000,Gesamt!G$4:G$1000)","v":0},{"$f":"LOOKUP(A90,Gesamt!A$4:A$1000,Gesamt!H$4:H$1000)","v":0},{"$f":"LOOKUP(A90,Gesamt!A$4:A$1000,Gesamt!I$4:I$1000)","v":0},{"$f":"LOOKUP(A90,Gesamt!A$4:A$1000,Gesamt!J$4:J$1000)","v":0},{"$f":"LOOKUP(A90,Gesamt!A$4:A$1000,Gesamt!K$4:K$1000)","v":0},{"$f":"LOOKUP(A90,Gesamt!A$4:A$1000,Gesamt!L$4:L$1000)","v":0},{"$f":"LOOKUP(A90,Gesamt!A$4:A$1000,Gesamt!M$4:M$1000)","v":0},{"$f":"IF(M90>0,M90*-1,-1000)","v":-1000},{"$f":"IF(M90>0,RANK(N90,N:N),0)","v":0}]
[783,{"$f":"LOOKUP(A91,Gesamt!A$4:A$1000,Gesamt!B$4:B$1000)","v":0},{"$f":"LOOKUP(A91,Gesamt!A$4:A$1000,Gesamt!C$4:C$1000)","v":0},{"$f":"LOOKUP(A91,Gesamt!A$4:A$1000,Gesamt!D$4:D$1000)","v":0},{"$f":"LOOKUP(A91,Gesamt!A$4:A$1000,Gesamt!E$4:E$1000)","v":0},{"$f":"LOOKUP(A91,Gesamt!A$4:A$1000,Gesamt!F$4:F$1000)","v":0},{"$f":"LOOKUP(A91,Gesamt!A$4:A$1000,Gesamt!G$4:G$1000)","v":0},{"$f":"LOOKUP(A91,Gesamt!A$4:A$1000,Gesamt!H$4:H$1000)","v":0},{"$f":"LOOKUP(A91,Gesamt!A$4:A$1000,Gesamt!I$4:I$1000)","v":0},{"$f":"LOOKUP(A91,Gesamt!A$4:A$1000,Gesamt!J$4:J$1000)","v":0},{"$f":"LOOKUP(A91,Gesamt!A$4:A$1000,Gesamt!K$4:K$1000)","v":0},{"$f":"LOOKUP(A91,Gesamt!A$4:A$1000,Gesamt!L$4:L$1000)","v":0},{"$f":"LOOKUP(A91,Gesamt!A$4:A$1000,Gesamt!M$4:M$1000)","v":0},{"$f":"IF(M91>0,M91*-1,-1000)","v":-1000},{"$f":"IF(M91>0,RANK(N91,N:N),0)","v":0}]
[784,{"$f":"LOOKUP(A92,Gesamt!A$4:A$1000,Gesamt!B$4:B$1000)","v":0},{"$f":"LOOKUP(A92,Gesamt!A$4:A$1000,Gesamt!C$4:C$1000)","v":0},{"$f":"LOOKUP(A92,Gesamt!A$4:A$1000,Gesamt!D$4:D$1000)","v":0},{"$f":"LOOKUP(A92,Gesamt!A$4:A$1000,Gesamt!E$4:E$1000)","v":0},{"$f":"LOOKUP(A92,Gesamt!A$4:A$1000,Gesamt!F$4:F$1000)","v":0},{"$f":"LOOKUP(A92,Gesamt!A$4:A$1000,Gesamt!G$4:G$1000)","v":0},{"$f":"LOOKUP(A92,Gesamt!A$4:A$1000,Gesamt!H$4:H$1000)","v":0},{"$f":"LOOKUP(A92,Gesamt!A$4:A$1000,Gesamt!I$4:I$1000)","v":0},{"$f":"LOOKUP(A92,Gesamt!A$4:A$1000,Gesamt!J$4:J$1000)","v":0},{"$f":"LOOKUP(A92,Gesamt!A$4:A$1000,Gesamt!K$4:K$1000)","v":0},{"$f":"LOOKUP(A92,Gesamt!A$4:A$1000,Gesamt!L$4:L$1000)","v":0},{"$f":"LOOKUP(A92,Gesamt!A$4:A$1000,Gesamt!M$4:M$1000)","v":0},{"$f":"IF(M92>0,M92*-1,-1000)","v":-1000},{"$f":"IF(M92>0,RANK(N92,N:N),0)","v":0}]
[785,{"$f":"LOOKUP(A93,Gesamt!A$4:A$1000,Gesamt!B$4:B$1000)","v":0},{"$f":"LOOKUP(A93,Gesamt!A$4:A$1000,Gesamt!C$4:C$1000)","v":0},{"$f":"LOOKUP(A93,Gesamt!A$4:A$1000,Gesamt!D$4:D$1000)","v":0},{"$f":"LOOKUP(A93,Gesamt!A$4:A$1000,Gesamt!E$4:E$1000)","v":0},{"$f":"LOOKUP(A93,Gesamt!A$4:A$1000,Gesamt!F$4:F$1000)","v":0},{"$f":"LOOKUP(A93,Gesamt!A$4:A$1000,Gesamt!G$4:G$1000)","v":0},{"$f":"LOOKUP(A93,Gesamt!A$4:A$1000,Gesamt!H$4:H$1000)","v":0},{"$f":"LOOKUP(A93,Gesamt!A$4:A$1000,Gesamt!I$4:I$1000)","v":0},{"$f":"LOOKUP(A93,Gesamt!A$4:A$1000,Gesamt!J$4:J$1000)","v":0},{"$f":"LOOKUP(A93,Gesamt!A$4:A$1000,Gesamt!K$4:K$1000)","v":0},{"$f":"LOOKUP(A93,Gesamt!A$4:A$1000,Gesamt!L$4:L$1000)","v":0},{"$f":"LOOKUP(A93,Gesamt!A$4:A$1000,Gesamt!M$4:M$1000)","v":0},{"$f":"IF(M93>0,M93*-1,-1000)","v":-1000},{"$f":"IF(M93>0,RANK(N93,N:N),0)","v":0}]
[786,{"$f":"LOOKUP(A94,Gesamt!A$4:A$1000,Gesamt!B$4:B$1000)","v":0},{"$f":"LOOKUP(A94,Gesamt!A$4:A$1000,Gesamt!C$4:C$1000)","v":0},{"$f":"LOOKUP(A94,Gesamt!A$4:A$1000,Gesamt!D$4:D$1000)","v":0},{"$f":"LOOKUP(A94,Gesamt!A$4:A$1000,Gesamt!E$4:E$1000)","v":0},{"$f":"LOOKUP(A94,Gesamt!A$4:A$1000,Gesamt!F$4:F$1000)","v":0},{"$f":"LOOKUP(A94,Gesamt!A$4:A$1000,Gesamt!G$4:G$1000)","v":0},{"$f":"LOOKUP(A94,Gesamt!A$4:A$1000,Gesamt!H$4:H$1000)","v":0},{"$f":"LOOKUP(A94,Gesamt!A$4:A$1000,Gesamt!I$4:I$1000)","v":0},{"$f":"LOOKUP(A94,Gesamt!A$4:A$1000,Gesamt!J$4:J$1000)","v":0},{"$f":"LOOKUP(A94,Gesamt!A$4:A$1000,Gesamt!K$4:K$1000)","v":0},{"$f":"LOOKUP(A94,Gesamt!A$4:A$1000,Gesamt!L$4:L$1000)","v":0},{"$f":"LOOKUP(A94,Gesamt!A$4:A$1000,Gesamt!M$4:M$1000)","v":0},{"$f":"IF(M94>0,M94*-1,-1000)","v":-1000},{"$f":"IF(M94>0,RANK(N94,N:N),0)","v":0}]
[787,{"$f":"LOOKUP(A95,Gesamt!A$4:A$1000,Gesamt!B$4:B$1000)","v":0},{"$f":"LOOKUP(A95,Gesamt!A$4:A$1000,Gesamt!C$4:C$1000)","v":0},{"$f":"LOOKUP(A95,Gesamt!A$4:A$1000,Gesamt!D$4:D$1000)","v":0},{"$f":"LOOKUP(A95,Gesamt!A$4:A$1000,Gesamt!E$4:E$1000)","v":0},{"$f":"LOOKUP(A95,Gesamt!A$4:A$1000,Gesamt!F$4:F$1000)","v":0},{"$f":"LOOKUP(A95,Gesamt!A$4:A$1000,Gesamt!G$4:G$1000)","v":0},{"$f":"LOOKUP(A95,Gesamt!A$4:A$1000,Gesamt!H$4:H$1000)","v":0},{"$f":"LOOKUP(A95,Gesamt!A$4:A$1000,Gesamt!I$4:I$1000)","v":0},{"$f":"LOOKUP(A95,Gesamt!A$4:A$1000,Gesamt!J$4:J$1000)","v":0},{"$f":"LOOKUP(A95,Gesamt!A$4:A$1000,Gesamt!K$4:K$1000)","v":0},{"$f":"LOOKUP(A95,Gesamt!A$4:A$1000,Gesamt!L$4:L$1000)","v":0},{"$f":"LOOKUP(A95,Gesamt!A$4:A$1000,Gesamt!M$4:M$1000)","v":0},{"$f":"IF(M95>0,M95*-1,-1000)","v":-1000},{"$f":"IF(M95>0,RANK(N95,N:N),0)","v":0}]
[788,{"$f":"LOOKUP(A96,Gesamt!A$4:A$1000,Gesamt!B$4:B$1000)","v":0},{"$f":"LOOKUP(A96,Gesamt!A$4:A$1000,Gesamt!C$4:C$1000)","v":0},{"$f":"LOOKUP(A96,Gesamt!A$4:A$1000,Gesamt!D$4:D$1000)","v":0},{"$f":"LOOKUP(A96,Gesamt!A$4:A$1000,Gesamt!E$4:E$1000)","v":0},{"$f":"LOOKUP(A96,Gesamt!A$4:A$1000,Gesamt!F$4:F$1000)","v":0},{"$f":"LOOKUP(A96,Gesamt!A$4:A$1000,Gesamt!G$4:G$1000)","v":0},{"$f":"LOOKUP(A96,Gesamt!A$4:A$1000,Gesamt!H$4:H$1000)","v":0},{"$f":"LOOKUP(A96,Gesamt!A$4:A$1000,Gesamt!I$4:I$1000)","v":0},{"$f":"LOOKUP(A96,Gesamt!A$4:A$1000,Gesamt!J$4:J$1000)","v":0},{"$f":"LOOKUP(A96,Gesamt!A$4:A$1000,Gesamt!K$4:K$1000)","v":0},{"$f":"LOOKUP(A96,Gesamt!A$4:A$1000,Gesamt!L$4:L$1000)","v":0},{"$f":"LOOKUP(A96,Gesamt!A$4:A$1000,Gesamt!M$4:M$1000)","v":0},{"$f":"IF(M96>0,M96*-1,-1000)","v":-1000},{"$f":"IF(M96>0,RANK(N96,N:N),0)","v":0}]
[789,{"$f":"LOOKUP(A97,Gesamt!A$4:A$1000,Gesamt!B$4:B$1000)","v":0},{"$f":"LOOKUP(A97,Gesamt!A$4:A$1000,Gesamt!C$4:C$1000)","v":0},{"$f":"LOOKUP(A97,Gesamt!A$4:A$1000,Gesamt!D$4:D$1000)","v":0},{"$f":"LOOKUP(A97,Gesamt!A$4:A$1000,Gesamt!E$4:E$1000)","v":0},{"$f":"LOOKUP(A97,Gesamt!A$4:A$1000,Gesamt!F$4:F$1000)","v":0},{"$f":"LOOKUP(A97,Gesamt!A$4:A$1000,Gesamt!G$4:G$1000)","v":0},{"$f":"LOOKUP(A97,Gesamt!A$4:A$1000,Gesamt!H$4:H$1000)","v":0},{"$f":"LOOKUP(A97,Gesamt!A$4:A$1000,Gesamt!I$4:I$1000)","v":0},{"$f":"LOOKUP(A97,Gesamt!A$4:A$1000,Gesamt!J$4:J$1000)","v":0},{"$f":"LOOKUP(A97,Gesamt!A$4:A$1000,Gesamt!K$4:K$1000)","v":0},{"$f":"LOOKUP(A97,Gesamt!A$4:A$1000,Gesamt!L$4:L$1000)","v":0},{"$f":"LOOKUP(A97,Gesamt!A$4:A$1000,Gesamt!M$4:M$1000)","v":0},{"$f":"IF(M97>0,M97*-1,-1000)","v":-1000},{"$f":"IF(M97>0,RANK(N97,N:N),0)","v":0}]
[790,{"$f":"LOOKUP(A98,Gesamt!A$4:A$1000,Gesamt!B$4:B$1000)","v":0},{"$f":"LOOKUP(A98,Gesamt!A$4:A$1000,Gesamt!C$4:C$1000)","v":0},{"$f":"LOOKUP(A98,Gesamt!A$4:A$1000,Gesamt!D$4:D$1000)","v":0},{"$f":"LOOKUP(A98,Gesamt!A$4:A$1000,Gesamt!E$4:E$1000)","v":0},{"$f":"LOOKUP(A98,Gesamt!A$4:A$1000,Gesamt!F$4:F$1000)","v":0},{"$f":"LOOKUP(A98,Gesamt!A$4:A$1000,Gesamt!G$4:G$1000)","v":0},{"$f":"LOOKUP(A98,Gesamt!A$4:A$1000,Gesamt!H$4:H$1000)","v":0},{"$f":"LOOKUP(A98,Gesamt!A$4:A$1000,Gesamt!I$4:I$1000)","v":0},{"$f":"LOOKUP(A98,Gesamt!A$4:A$1000,Gesamt!J$4:J$1000)","v":0},{"$f":"LOOKUP(A98,Gesamt!A$4:A$1000,Gesamt!K$4:K$1000)","v":0},{"$f":"LOOKUP(A98,Gesamt!A$4:A$1000,Gesamt!L$4:L$1000)","v":0},{"$f":"LOOKUP(A98,Gesamt!A$4:A$1000,Gesamt!M$4:M$1000)","v":0},{"$f":"IF(M98>0,M98*-1,-1000)","v":-1000},{"$f":"IF(M98>0,RANK(N98,N:N),0)","v":0}]
[791,{"$f":"LOOKUP(A99,Gesamt!A$4:A$1000,Gesamt!B$4:B$1000)","v":0},{"$f":"LOOKUP(A99,Gesamt!A$4:A$1000,Gesamt!C$4:C$1000)","v":0},{"$f":"LOOKUP(A99,Gesamt!A$4:A$1000,Gesamt!D$4:D$1000)","v":0},{"$f":"LOOKUP(A99,Gesamt!A$4:A$1000,Gesamt!E$4:E$1000)","v":0},{"$f":"LOOKUP(A99,Gesamt!A$4:A$1000,Gesamt!F$4:F$1000)","v":0},{"$f":"LOOKUP(A99,Gesamt!A$4:A$1000,Gesamt!G$4:G$1000)","v":0},{"$f":"LOOKUP(A99,Gesamt!A$4:A$1000,Gesamt!H$4:H$1000)","v":0},{"$f":"LOOKUP(A99,Gesamt!A$4:A$1000,Gesamt!I$4:I$1000)","v":0},{"$f":"LOOKUP(A99,Gesamt!A$4:A$1000,Gesamt!J$4:J$1000)","v":0},{"$f":"LOOKUP(A99,Gesamt!A$4:A$1000,Gesamt!K$4:K$1000)","v":0},{"$f":"LOOKUP(A99,Gesamt!A$4:A$1000,Gesamt!L$4:L$1000)","v":0},{"$f":"LOOKUP(A99,Gesamt!A$4:A$1000,Gesamt!M$4:M$1000)","v":0},{"$f":"IF(M99>0,M99*-1,-1000)","v":-1000},{"$f":"IF(M99>0,RANK(N99,N:N),0)","v":0}]
[792,{"$f":"LOOKUP(A100,Gesamt!A$4:A$1000,Gesamt!B$4:B$1000)","v":0},{"$f":"LOOKUP(A100,Gesamt!A$4:A$1000,Gesamt!C$4:C$1000)","v":0},{"$f":"LOOKUP(A100,Gesamt!A$4:A$1000,Gesamt!D$4:D$1000)","v":0},{"$f":"LOOKUP(A100,Gesamt!A$4:A$1000,Gesamt!E$4:E$1000)","v":0},{"$f":"LOOKUP(A100,Gesamt!A$4:A$1000,Gesamt!F$4:F$1000)","v":0},{"$f":"LOOKUP(A100,Gesamt!A$4:A$1000,Gesamt!G$4:G$1000)","v":0},{"$f":"LOOKUP(A100,Gesamt!A$4:A$1000,Gesamt!H$4:H$1000)","v":0},{"$f":"LOOKUP(A100,Gesamt!A$4:A$1000,Gesamt!I$4:I$1000)","v":0},{"$f":"LOOKUP(A100,Gesamt!A$4:A$1000,Gesamt!J$4:J$1000)","v":0},{"$f":"LOOKUP(A100,Gesamt!A$4:A$1000,Gesamt!K$4:K$1000)","v":0},{"$f":"LOOKUP(A100,Gesamt!A$4:A$1000,Gesamt!L$4:L$1000)","v":0},{"$f":"LOOKUP(A100,Gesamt!A$4:A$1000,Gesamt!M$4:M$1000)","v":0},{"$f":"IF(M100>0,M100*-1,-1000)","v":-1000},{"$f":"IF(M100>0,RANK(N100,N:N),0)","v":0}]
[793,{"$f":"LOOKUP(A101,Gesamt!A$4:A$1000,Gesamt!B$4:B$1000)","v":0},{"$f":"LOOKUP(A101,Gesamt!A$4:A$1000,Gesamt!C$4:C$1000)","v":0},{"$f":"LOOKUP(A101,Gesamt!A$4:A$1000,Gesamt!D$4:D$1000)","v":0},{"$f":"LOOKUP(A101,Gesamt!A$4:A$1000,Gesamt!E$4:E$1000)","v":0},{"$f":"LOOKUP(A101,Gesamt!A$4:A$1000,Gesamt!F$4:F$1000)","v":0},{"$f":"LOOKUP(A101,Gesamt!A$4:A$1000,Gesamt!G$4:G$1000)","v":0},{"$f":"LOOKUP(A101,Gesamt!A$4:A$1000,Gesamt!H$4:H$1000)","v":0},{"$f":"LOOKUP(A101,Gesamt!A$4:A$1000,Gesamt!I$4:I$1000)","v":0},{"$f":"LOOKUP(A101,Gesamt!A$4:A$1000,Gesamt!J$4:J$1000)","v":0},{"$f":"LOOKUP(A101,Gesamt!A$4:A$1000,Gesamt!K$4:K$1000)","v":0},{"$f":"LOOKUP(A101,Gesamt!A$4:A$1000,Gesamt!L$4:L$1000)","v":0},{"$f":"LOOKUP(A101,Gesamt!A$4:A$1000,Gesamt!M$4:M$1000)","v":0},{"$f":"IF(M101>0,M101*-1,-1000)","v":-1000},{"$f":"IF(M101>0,RANK(N101,N:N),0)","v":0}]
[794,{"$f":"LOOKUP(A102,Gesamt!A$4:A$1000,Gesamt!B$4:B$1000)","v":0},{"$f":"LOOKUP(A102,Gesamt!A$4:A$1000,Gesamt!C$4:C$1000)","v":0},{"$f":"LOOKUP(A102,Gesamt!A$4:A$1000,Gesamt!D$4:D$1000)","v":0},{"$f":"LOOKUP(A102,Gesamt!A$4:A$1000,Gesamt!E$4:E$1000)","v":0},{"$f":"LOOKUP(A102,Gesamt!A$4:A$1000,Gesamt!F$4:F$1000)","v":0},{"$f":"LOOKUP(A102,Gesamt!A$4:A$1000,Gesamt!G$4:G$1000)","v":0},{"$f":"LOOKUP(A102,Gesamt!A$4:A$1000,Gesamt!H$4:H$1000)","v":0},{"$f":"LOOKUP(A102,Gesamt!A$4:A$1000,Gesamt!I$4:I$1000)","v":0},{"$f":"LOOKUP(A102,Gesamt!A$4:A$1000,Gesamt!J$4:J$1000)","v":0},{"$f":"LOOKUP(A102,Gesamt!A$4:A$1000,Gesamt!K$4:K$1000)","v":0},{"$f":"LOOKUP(A102,Gesamt!A$4:A$1000,Gesamt!L$4:L$1000)","v":0},{"$f":"LOOKUP(A102,Gesamt!A$4:A$1000,Gesamt!M$4:M$1000)","v":0},{"$f":"IF(M102>0,M102*-1,-1000)","v":-1000},{"$f":"IF(M102>0,RANK(N102,N:N),0)","v":0}]
[795,{"$f":"LOOKUP(A103,Gesamt!A$4:A$1000,Gesamt!B$4:B$1000)","v":0},{"$f":"LOOKUP(A103,Gesamt!A$4:A$1000,Gesamt!C$4:C$1000)","v":0},{"$f":"LOOKUP(A103,Gesamt!A$4:A$1000,Gesamt!D$4:D$1000)","v":0},{"$f":"LOOKUP(A103,Gesamt!A$4:A$1000,Gesamt!E$4:E$1000)","v":0},{"$f":"LOOKUP(A103,Gesamt!A$4:A$1000,Gesamt!F$4:F$1000)","v":0},{"$f":"LOOKUP(A103,Gesamt!A$4:A$1000,Gesamt!G$4:G$1000)","v":0},{"$f":"LOOKUP(A103,Gesamt!A$4:A$1000,Gesamt!H$4:H$1000)","v":0},{"$f":"LOOKUP(A103,Gesamt!A$4:A$1000,Gesamt!I$4:I$1000)","v":0},{"$f":"LOOKUP(A103,Gesamt!A$4:A$1000,Gesamt!J$4:J$1000)","v":0},{"$f":"LOOKUP(A103,Gesamt!A$4:A$1000,Gesamt!K$4:K$1000)","v":0},{"$f":"LOOKUP(A103,Gesamt!A$4:A$1000,Gesamt!L$4:L$1000)","v":0},{"$f":"LOOKUP(A103,Gesamt!A$4:A$1000,Gesamt!M$4:M$1000)","v":0},{"$f":"IF(M103>0,M103*-1,-1000)","v":-1000},{"$f":"IF(M103>0,RANK(N103,N:N),0)","v":0}]
[796,{"$f":"LOOKUP(A104,Gesamt!A$4:A$1000,Gesamt!B$4:B$1000)","v":0},{"$f":"LOOKUP(A104,Gesamt!A$4:A$1000,Gesamt!C$4:C$1000)","v":0},{"$f":"LOOKUP(A104,Gesamt!A$4:A$1000,Gesamt!D$4:D$1000)","v":0},{"$f":"LOOKUP(A104,Gesamt!A$4:A$1000,Gesamt!E$4:E$1000)","v":0},{"$f":"LOOKUP(A104,Gesamt!A$4:A$1000,Gesamt!F$4:F$1000)","v":0},{"$f":"LOOKUP(A104,Gesamt!A$4:A$1000,Gesamt!G$4:G$1000)","v":0},{"$f":"LOOKUP(A104,Gesamt!A$4:A$1000,Gesamt!H$4:H$1000)","v":0},{"$f":"LOOKUP(A104,Gesamt!A$4:A$1000,Gesamt!I$4:I$1000)","v":0},{"$f":"LOOKUP(A104,Gesamt!A$4:A$1000,Gesamt!J$4:J$1000)","v":0},{"$f":"LOOKUP(A104,Gesamt!A$4:A$1000,Gesamt!K$4:K$1000)","v":0},{"$f":"LOOKUP(A104,Gesamt!A$4:A$1000,Gesamt!L$4:L$1000)","v":0},{"$f":"LOOKUP(A104,Gesamt!A$4:A$1000,Gesamt!M$4:M$1000)","v":0},{"$f":"IF(M104>0,M104*-1,-1000)","v":-1000},{"$f":"IF(M104>0,RANK(N104,N:N),0)","v":0}]
[797,{"$f":"LOOKUP(A105,Gesamt!A$4:A$1000,Gesamt!B$4:B$1000)","v":0},{"$f":"LOOKUP(A105,Gesamt!A$4:A$1000,Gesamt!C$4:C$1000)","v":0},{"$f":"LOOKUP(A105,Gesamt!A$4:A$1000,Gesamt!D$4:D$1000)","v":0},{"$f":"LOOKUP(A105,Gesamt!A$4:A$1000,Gesamt!E$4:E$1000)","v":0},{"$f":"LOOKUP(A105,Gesamt!A$4:A$1000,Gesamt!F$4:F$1000)","v":0},{"$f":"LOOKUP(A105,Gesamt!A$4:A$1000,Gesamt!G$4:G$1000)","v":0},{"$f":"LOOKUP(A105,Gesamt!A$4:A$1000,Gesamt!H$4:H$1000)","v":0},{"$f":"LOOKUP(A105,Gesamt!A$4:A$1000,Gesamt!I$4:I$1000)","v":0},{"$f":"LOOKUP(A105,Gesamt!A$4:A$1000,Gesamt!J$4:J$1000)","v":0},{"$f":"LOOKUP(A105,Gesamt!A$4:A$1000,Gesamt!K$4:K$1000)","v":0},{"$f":"LOOKUP(A105,Gesamt!A$4:A$1000,Gesamt!L$4:L$1000)","v":0},{"$f":"LOOKUP(A105,Gesamt!A$4:A$1000,Gesamt!M$4:M$1000)","v":0},{"$f":"IF(M105>0,M105*-1,-1000)","v":-1000},{"$f":"IF(M105>0,RANK(N105,N:N),0)","v":0}]
[798,{"$f":"LOOKUP(A106,Gesamt!A$4:A$1000,Gesamt!B$4:B$1000)","v":0},{"$f":"LOOKUP(A106,Gesamt!A$4:A$1000,Gesamt!C$4:C$1000)","v":0},{"$f":"LOOKUP(A106,Gesamt!A$4:A$1000,Gesamt!D$4:D$1000)","v":0},{"$f":"LOOKUP(A106,Gesamt!A$4:A$1000,Gesamt!E$4:E$1000)","v":0},{"$f":"LOOKUP(A106,Gesamt!A$4:A$1000,Gesamt!F$4:F$1000)","v":0},{"$f":"LOOKUP(A106,Gesamt!A$4:A$1000,Gesamt!G$4:G$1000)","v":0},{"$f":"LOOKUP(A106,Gesamt!A$4:A$1000,Gesamt!H$4:H$1000)","v":0},{"$f":"LOOKUP(A106,Gesamt!A$4:A$1000,Gesamt!I$4:I$1000)","v":0},{"$f":"LOOKUP(A106,Gesamt!A$4:A$1000,Gesamt!J$4:J$1000)","v":0},{"$f":"LOOKUP(A106,Gesamt!A$4:A$1000,Gesamt!K$4:K$1000)","v":0},{"$f":"LOOKUP(A106,Gesamt!A$4:A$1000,Gesamt!L$4:L$1000)","v":0},{"$f":"LOOKUP(A106,Gesamt!A$4:A$1000,Gesamt!M$4:M$1000)","v":0},{"$f":"IF(M106>0,M106*-1,-1000)","v":-1000},{"$f":"IF(M106>0,RANK(N106,N:N),0)","v":0}]
[799,{"$f":"LOOKUP(A107,Gesamt!A$4:A$1000,Gesamt!B$4:B$1000)","v":0},{"$f":"LOOKUP(A107,Gesamt!A$4:A$1000,Gesamt!C$4:C$1000)","v":0},{"$f":"LOOKUP(A107,Gesamt!A$4:A$1000,Gesamt!D$4:D$1000)","v":0},{"$f":"LOOKUP(A107,Gesamt!A$4:A$1000,Gesamt!E$4:E$1000)","v":0},{"$f":"LOOKUP(A107,Gesamt!A$4:A$1000,Gesamt!F$4:F$1000)","v":0},{"$f":"LOOKUP(A107,Gesamt!A$4:A$1000,Gesamt!G$4:G$1000)","v":0},{"$f":"LOOKUP(A107,Gesamt!A$4:A$1000,Gesamt!H$4:H$1000)","v":0},{"$f":"LOOKUP(A107,Gesamt!A$4:A$1000,Gesamt!I$4:I$1000)","v":0},{"$f":"LOOKUP(A107,Gesamt!A$4:A$1000,Gesamt!J$4:J$1000)","v":0},{"$f":"LOOKUP(A107,Gesamt!A$4:A$1000,Gesamt!K$4:K$1000)","v":0},{"$f":"LOOKUP(A107,Gesamt!A$4:A$1000,Gesamt!L$4:L$1000)","v":0},{"$f":"LOOKUP(A107,Gesamt!A$4:A$1000,Gesamt!M$4:M$1000)","v":0},{"$f":"IF(M107>0,M107*-1,-1000)","v":-1000},{"$f":"IF(M107>0,RANK(N107,N:N),0)","v":0}]

{"sheet":"ErgebnisEndlauf","index":4,"n_rows":107,"n_cols":16,"rows_kept":107,"cut":false,"hidden":false,"merged":[[2,0,2,11],[3,12,5,14],[4,6,4,11]]}
["21.08.2022   DSKD Derby Seppenrade"]
["Endlauf JUNIOR - Klasse"]
[]
[null,null,null,null,null,null,{"$f":"Gesamt!G2","v":1},{"$f":"Gesamt!H2","v":1},{"$f":"Gesamt!I2","v":1},{"$f":"Gesamt!J2","v":1},{"$f":"Gesamt!K2","v":1},{"$f":"Gesamt!L2","v":1},"Blatt ist\nschreibgeschützt"]
[null,null,null,null,null,null,"Wird der Lauf gewertet?   dann 0 oder 1 "]
[]
["Start\nNummer","Gruppe","NRW","Name","Vorname","Verein","Lauf 1","Lauf 2","Lauf 3","Lauf 4","Lauf 5","Lauf 6","Summe der gewerteten Läufe",null,"Platz","Urkunde"]
[]
[101,{"$f":"LOOKUP(A9,Gesamt!A$4:A$1000,Gesamt!B$4:B$1000)","v":"JUN"},{"$f":"LOOKUP(A9,Gesamt!A$4:A$1000,Gesamt!C$4:C$1000)","v":0},{"$f":"LOOKUP(A9,Gesamt!A$4:A$1000,Gesamt!D$4:D$1000)","v":"Thiemann"},{"$f":"LOOKUP(A9,Gesamt!A$4:A$1000,Gesamt!E$4:E$1000)","v":"Jela"},{"$f":"LOOKUP(A9,Gesamt!A$4:A$1000,Gesamt!F$4:F$1000)","v":"Stromberg"},{"$f":"LOOKUP(A9,Gesamt!A$4:A$1000,Gesamt!N$4:N$1000)","v":0},{"$f":"LOOKUP(A9,Gesamt!A$4:A$1000,Gesamt!O$4:O$1000)","v":0},{"$f":"LOOKUP(A9,Gesamt!A$4:A$1000,Gesamt!P$4:P$1000)","v":0},{"$f":"LOOKUP(A9,Gesamt!A$4:A$1000,Gesamt!Q$4:Q$1000)","v":0},{"$f":"LOOKUP(A9,Gesamt!A$4:A$1000,Gesamt!R$4:R$1000)","v":0},{"$f":"LOOKUP(A9,Gesamt!A$4:A$1000,Gesamt!S$4:S$1000)","v":0},{"$f":"LOOKUP(A9,Gesamt!A$4:A$1000,Gesamt!T$4:T$1000)","v":0},{"$f":"IF(M9>0,M9*-1,-1000)","v":-1000},{"$f":"IF(M9>0,RANK(N9,N:N),0)","v":0}]
[102,{"$f":"LOOKUP(A10,Gesamt!A$4:A$1000,Gesamt!B$4:B$1000)","v":"JUN"},{"$f":"LOOKUP(A10,Gesamt!A$4:A$1000,Gesamt!C$4:C$1000)","v":0},{"$f":"LOOKUP(A10,Gesamt!A$4:A$1000,Gesamt!D$4:D$1000)","v":"Obermeyer"},{"$f":"LOOKUP(A10,Gesamt!A$4:A$1000,Gesamt!E$4:E$1000)","v":"Theo"},{"$f":"LOOKUP(A10,Gesamt!A$4:A$1000,Gesamt!F$4:F$1000)","v":"Mettingen"},{"$f":"LOOKUP(A10,Gesamt!A$4:A$1000,Gesamt!N$4:N$1000)","v":0},{"$f":"LOOKUP(A10,Gesamt!A$4:A$1000,Gesamt!O$4:O$1000)","v":0},{"$f":"LOOKUP(A10,Gesamt!A$4:A$1000,Gesamt!P$4:P$1000)","v":0},{"$f":"LOOKUP(A10,Gesamt!A$4:A$1000,Gesamt!Q$4:Q$1000)","v":0},{"$f":"LOOKUP(A10,Gesamt!A$4:A$1000,Gesamt!R$4:R$1000)","v":0},{"$f":"LOOKUP(A10,Gesamt!A$4:A$1000,Gesamt!S$4:S$1000)","v":0},{"$f":"LOOKUP(A10,Gesamt!A$4:A$1000,Gesamt!T$4:T$1000)","v":0},-1000,0]
[103,{"$f":"LOOKUP(A11,Gesamt!A$4:A$1000,Gesamt!B$4:B$1000)","v":"JUN"},{"$f":"LOOKUP(A11,Gesamt!A$4:A$1000,Gesamt!C$4:C$1000)","v":0},{"$f":"LOOKUP(A11,Gesamt!A$4:A$1000,Gesamt!D$4:D$1000)","v":"Farwig"},{"$f":"LOOKUP(A11,Gesamt!A$4:A$1000,Gesamt!E$4:E$1000)","v":"Alexander"},{"$f":"LOOKUP(A11,Gesamt!A$4:A$1000,Gesamt!F$4:F$1000)","v":"Mettingen"},{"$f":"LOOKUP(A11,Gesamt!A$4:A$1000,Gesamt!N$4:N$1000)","v":0},{"$f":"LOOKUP(A11,Gesamt!A$4:A$1000,Gesamt!O$4:O$1000)","v":0},{"$f":"LOOKUP(A11,Gesamt!A$4:A$1000,Gesamt!P$4:P$1000)","v":0},{"$f":"LOOKUP(A11,Gesamt!A$4:A$1000,Gesamt!Q$4:Q$1000)","v":0},{"$f":"LOOKUP(A11,Gesamt!A$4:A$1000,Gesamt!R$4:R$1000)","v":0},{"$f":"LOOKUP(A11,Gesamt!A$4:A$1000,Gesamt!S$4:S$1000)","v":0},{"$f":"LOOKUP(A11,Gesamt!A$4:A$1000,Gesamt!T$4:T$1000)","v":0},-1000,0]
[104,{"$f":"LOOKUP(A12,Gesamt!A$4:A$1000,Gesamt!B$4:B$1000)","v":"JUN"},{"$f":"LOOKUP(A12,Gesamt!A$4:A$1000,Gesamt!C$4:C$1000)","v":0},{"$f":"LOOKUP(A12,Gesamt!A$4:A$1000,Gesamt!D$4:D$1000)","v":"Rickard"},{"$f":"LOOKUP(A12,Gesamt!A$4:A$1000,Gesamt!E$4:E$1000)","v":"Julia"},{"$f":"LOOKUP(A12,Gesamt!A$4:A$1000,Gesamt!F$4:F$1000)","v":"Billerbeck"},{"$f":"LOOKUP(A12,Gesamt!A$4:A$1000,Gesamt!N$4:N$1000)","v":0},{"$f":"LOOKUP(A12,Gesamt!A$4:A$1000,Gesamt!O$4:O$1000)","v":0},{"$f":"LOOKUP(A12,Gesamt!A$4:A$1000,Gesamt!P$4:P$1000)","v":0},{"$f":"LOOKUP(A12,Gesamt!A$4:A$1000,Gesamt!Q$4:Q$1000)","v":0},{"$f":"LOOKUP(A12,Gesamt!A$4:A$1000,Gesamt!R$4:R$1000)","v":0},{"$f":"LOOKUP(A12,Gesamt!A$4:A$1000,Gesamt!S$4:S$1000)","v":0},{"$f":"LOOKUP(A12,Gesamt!A$4:A$1000,Gesamt!T$4:T$1000)","v":0},-1000,0]
[105,{"$f":"LOOKUP(A13,Gesamt!A$4:A$1000,Gesamt!B$4:B$1000)","v":"JUN"},{"$f":"LOOKUP(A13,Gesamt!A$4:A$1000,Gesamt!C$4:C$1000)","v":0},{"$f":"LOOKUP(A13,Gesamt!A$4:A$1000,Gesamt!D$4:D$1000)","v":"Averkamp"},{"$f":"LOOKUP(A13,Gesamt!A$4:A$1000,Gesamt!E$4:E$1000)","v":"Milan"},{"$f":"LOOKUP(A13,Gesamt!A$4:A$1000,Gesamt!F$4:F$1000)","v":"Billerbeck"},{"$f":"LOOKUP(A13,Gesamt!A$4:A$1000,Gesamt!N$4:N$1000)","v":0},{"$f":"LOOKUP(A13,Gesamt!A$4:A$1000,Gesamt!O$4:O$1000)","v":0},{"$f":"LOOKUP(A13,Gesamt!A$4:A$1000,Gesamt!P$4:P$1000)","v":0},{"$f":"LOOKUP(A13,Gesamt!A$4:A$1000,Gesamt!Q$4:Q$1000)","v":0},{"$f":"LOOKUP(A13,Gesamt!A$4:A$1000,Gesamt!R$4:R$1000)","v":0},{"$f":"LOOKUP(A13,Gesamt!A$4:A$1000,Gesamt!S$4:S$1000)","v":0},{"$f":"LOOKUP(A13,Gesamt!A$4:A$1000,Gesamt!T$4:T$1000)","v":0},-1000,0]
[106,{"$f":"LOOKUP(A14,Gesamt!A$4:A$1000,Gesamt!B$4:B$1000)","v":"JUN"},{"$f":"LOOKUP(A14,Gesamt!A$4:A$1000,Gesamt!C$4:C$1000)","v":0},{"$f":"LOOKUP(A14,Gesamt!A$4:A$1000,Gesamt!D$4:D$1000)","v":"Lange"},{"$f":"LOOKUP(A14,Gesamt!A$4:A$1000,Gesamt!E$4:E$1000)","v":"Peter"},{"$f":"LOOKUP(A14,Gesamt!A$4:A$1000,Gesamt!F$4:F$1000)","v":"Mettingen"},{"$f":"LOOKUP(A14,Gesamt!A$4:A$1000,Gesamt!N$4:N$1000)","v":0},{"$f":"LOOKUP(A14,Gesamt!A$4:A$1000,Gesamt!O$4:O$1000)","v":0},{"$f":"LOOKUP(A14,Gesamt!A$4:A$1000,Gesamt!P$4:P$1000)","v":0},{"$f":"LOOKUP(A14,Gesamt!A$4:A$1000,Gesamt!Q$4:Q$1000)","v":0},{"$f":"LOOKUP(A14,Gesamt!A$4:A$1000,Gesamt!R$4:R$1000)","v":0},{"$f":"LOOKUP(A14,Gesamt!A$4:A$1000,Gesamt!S$4:S$1000)","v":0},{"$f":"LOOKUP(A14,Gesamt!A$4:A$1000,Gesamt!T$4:T$1000)","v":0},-1000,0]
[107,{"$f":"LOOKUP(A15,Gesamt!A$4:A$1000,Gesamt!B$4:B$1000)","v":"JUN"},{"$f":"LOOKUP(A15,Gesamt!A$4:A$1000,Gesamt!C$4:C$1000)","v":0},{"$f":"LOOKUP(A15,Gesamt!A$4:A$1000,Gesamt!D$4:D$1000)","v":"Teeken"},{"$f":"LOOKUP(A15,Gesamt!A$4:A$1000,Gesamt!E$4:E$1000)","v":"Jorik"},{"$f":"LOOKUP(A15,Gesamt!A$4:A$1000,Gesamt!F$4:F$1000)","v":"Mettingen"},{"$f":"LOOKUP(A15,Gesamt!A$4:A$1000,Gesamt!N$4:N$1000)","v":0},{"$f":"LOOKUP(A15,Gesamt!A$4:A$1000,Gesamt!O$4:O$1000)","v":0},{"$f":"LOOKUP(A15,Gesamt!A$4:A$1000,Gesamt!P$4:P$1000)","v":0},{"$f":"LOOKUP(A15,Gesamt!A$4:A$1000,Gesamt!Q$4:Q$1000)","v":0},{"$f":"LOOKUP(A15,Gesamt!A$4:A$1000,Gesamt!R$4:R$1000)","v":0},{"$f":"LOOKUP(A15,Gesamt!A$4:A$1000,Gesamt!S$4:S$1000)","v":0},{"$f":"LOOKUP(A15,Gesamt!A$4:A$1000,Gesamt!T$4:T$1000)","v":0},-1000,0]
[108,{"$f":"LOOKUP(A16,Gesamt!A$4:A$1000,Gesamt!B$4:B$1000)","v":"JUN"},{"$f":"LOOKUP(A16,Gesamt!A$4:A$1000,Gesamt!C$4:C$1000)","v":0},{"$f":"LOOKUP(A16,Gesamt!A$4:A$1000,Gesamt!D$4:D$1000)","v":"Bednarski"},{"$f":"LOOKUP(A16,Gesamt!A$4:A$1000,Gesamt!E$4:E$1000)","v":"Frederik"},{"$f":"LOOKUP(A16,Gesamt!A$4:A$1000,Gesamt!F$4:F$1000)","v":"Mettingen"},{"$f":"LOOKUP(A16,Gesamt!A$4:A$1000,Gesamt!N$4:N$1000)","v":0},{"$f":"LOOKUP(A16,Gesamt!A$4:A$1000,Gesamt!O$4:O$1000)","v":0},{"$f":"LOOKUP(A16,Gesamt!A$4:A$1000,Gesamt!P$4:P$1000)","v":0},{"$f":"LOOKUP(A16,Gesamt!A$4:A$1000,Gesamt!Q$4:Q$1000)","v":0},{"$f":"LOOKUP(A16,Gesamt!A$4:A$1000,Gesamt!R$4:R$1000)","v":0},{"$f":"LOOKUP(A16,Gesamt!A$4:A$1000,Gesamt!S$4:S$1000)","v":0},{"$f":"LOOKUP(A16,Gesamt!A$4:A$1000,Gesamt!T$4:T$1000)","v":0},-1000,0]
[109,{"$f":"LOOKUP(A17,Gesamt!A$4:A$1000,Gesamt!B$4:B$1000)","v":"JUN"},{"$f":"LOOKUP(A17,Gesamt!A$4:A$1000,Gesamt!C$4:C$1000)","v":0},{"$f":"LOOKUP(A17,Gesamt!A$4:A$1000,Gesamt!D$4:D$1000)","v":"Lüttmann"},{"$f":"LOOKUP(A17,Gesamt!A$4:A$1000,Gesamt!E$4:E$1000)","v":"Merle"},{"$f":"LOOKUP(A17,Gesamt!A$4:A$1000,Gesamt!F$4:F$1000)","v":"Mettingen"},{"$f":"LOOKUP(A17,Gesamt!A$4:A$1000,Gesamt!N$4:N$1000)","v":0},{"$f":"LOOKUP(A17,Gesamt!A$4:A$1000,Gesamt!O$4:O$1000)","v":0},{"$f":"LOOKUP(A17,Gesamt!A$4:A$1000,Gesamt!P$4:P$1000)","v":0},{"$f":"LOOKUP(A17,Gesamt!A$4:A$1000,Gesamt!Q$4:Q$1000)","v":0},{"$f":"LOOKUP(A17,Gesamt!A$4:A$1000,Gesamt!R$4:R$1000)","v":0},{"$f":"LOOKUP(A17,Gesamt!A$4:A$1000,Gesamt!S$4:S$1000)","v":0},{"$f":"LOOKUP(A17,Gesamt!A$4:A$1000,Gesamt!T$4:T$1000)","v":0},-1000,0]
[110,{"$f":"LOOKUP(A18,Gesamt!A$4:A$1000,Gesamt!B$4:B$1000)","v":"JUN"},{"$f":"LOOKUP(A18,Gesamt!A$4:A$1000,Gesamt!C$4:C$1000)","v":0},{"$f":"LOOKUP(A18,Gesamt!A$4:A$1000,Gesamt!D$4:D$1000)","v":"Bauer"},{"$f":"LOOKUP(A18,Gesamt!A$4:A$1000,Gesamt!E$4:E$1000)","v":"Bella"},{"$f":"LOOKUP(A18,Gesamt!A$4:A$1000,Gesamt!F$4:F$1000)","v":"Stromberg"},{"$f":"LOOKUP(A18,Gesamt!A$4:A$1000,Gesamt!N$4:N$1000)","v":0},{"$f":"LOOKUP(A18,Gesamt!A$4:A$1000,Gesamt!O$4:O$1000)","v":0},{"$f":"LOOKUP(A18,Gesamt!A$4:A$1000,Gesamt!P$4:P$1000)","v":0},{"$f":"LOOKUP(A18,Gesamt!A$4:A$1000,Gesamt!Q$4:Q$1000)","v":0},{"$f":"LOOKUP(A18,Gesamt!A$4:A$1000,Gesamt!R$4:R$1000)","v":0},{"$f":"LOOKUP(A18,Gesamt!A$4:A$1000,Gesamt!S$4:S$1000)","v":0},{"$f":"LOOKUP(A18,Gesamt!A$4:A$1000,Gesamt!T$4:T$1000)","v":0},-1000,0]
[111,{"$f":"LOOKUP(A19,Gesamt!A$4:A$1000,Gesamt!B$4:B$1000)","v":"JUN"},{"$f":"LOOKUP(A19,Gesamt!A$4:A$1000,Gesamt!C$4:C$1000)","v":0},{"$f":"LOOKUP(A19,Gesamt!A$4:A$1000,Gesamt!D$4:D$1000)","v":"Lange"},{"$f":"LOOKUP(A19,Gesamt!A$4:A$1000,Gesamt!E$4:E$1000)","v":"Helene"},{"$f":"LOOKUP(A19,Gesamt!A$4:A$1000,Gesamt!F$4:F$1000)","v":"Mettingen"},{"$f":"LOOKUP(A19,Gesamt!A$4:A$1000,Gesamt!N$4:N$1000)","v":0},{"$f":"LOOKUP(A19,Gesamt!A$4:A$1000,Gesamt!O$4:O$1000)","v":0},{"$f":"LOOKUP(A19,Gesamt!A$4:A$1000,Gesamt!P$4:P$1000)","v":0},{"$f":"LOOKUP(A19,Gesamt!A$4:A$1000,Gesamt!Q$4:Q$1000)","v":0},{"$f":"LOOKUP(A19,Gesamt!A$4:A$1000,Gesamt!R$4:R$1000)","v":0},{"$f":"LOOKUP(A19,Gesamt!A$4:A$1000,Gesamt!S$4:S$1000)","v":0},{"$f":"LOOKUP(A19,Gesamt!A$4:A$1000,Gesamt!T$4:T$1000)","v":0},-1000,0]
[112,{"$f":"LOOKUP(A20,Gesamt!A$4:A$1000,Gesamt!B$4:B$1000)","v":"JUN"},{"$f":"LOOKUP(A20,Gesamt!A$4:A$1000,Gesamt!C$4:C$1000)","v":0},{"$f":"LOOKUP(A20,Gesamt!A$4:A$1000,Gesamt!D$4:D$1000)","v":"Teeken"},{"$f":"LOOKUP(A20,Gesamt!A$4:A$1000,Gesamt!E$4:E$1000)","v":"Lasse"},{"$f":"LOOKUP(A20,Gesamt!A$4:A$1000,Gesamt!F$4:F$1000)","v":"Mettingen"},{"$f":"LOOKUP(A20,Gesamt!A$4:A$1000,Gesamt!N$4:N$1000)","v":0},{"$f":"LOOKUP(A20,Gesamt!A$4:A$1000,Gesamt!O$4:O$1000)","v":0},{"$f":"LOOKUP(A20,Gesamt!A$4:A$1000,Gesamt!P$4:P$1000)","v":0},{"$f":"LOOKUP(A20,Gesamt!A$4:A$1000,Gesamt!Q$4:Q$1000)","v":0},{"$f":"LOOKUP(A20,Gesamt!A$4:A$1000,Gesamt!R$4:R$1000)","v":0},{"$f":"LOOKUP(A20,Gesamt!A$4:A$1000,Gesamt!S$4:S$1000)","v":0},{"$f":"LOOKUP(A20,Gesamt!A$4:A$1000,Gesamt!T$4:T$1000)","v":0},-1000,0]
[113,{"$f":"LOOKUP(A21,Gesamt!A$4:A$1000,Gesamt!B$4:B$1000)","v":"JUN"},{"$f":"LOOKUP(A21,Gesamt!A$4:A$1000,Gesamt!C$4:C$1000)","v":0},{"$f":"LOOKUP(A21,Gesamt!A$4:A$1000,Gesamt!D$4:D$1000)","v":"Runde"},{"$f":"LOOKUP(A21,Gesamt!A$4:A$1000,Gesamt!E$4:E$1000)","v":"Helga"},{"$f":"LOOKUP(A21,Gesamt!A$4:A$1000,Gesamt!F$4:F$1000)","v":"Mettingen"},{"$f":"LOOKUP(A21,Gesamt!A$4:A$1000,Gesamt!N$4:N$1000)","v":0},{"$f":"LOOKUP(A21,Gesamt!A$4:A$1000,Gesamt!O$4:O$1000)","v":0},{"$f":"LOOKUP(A21,Gesamt!A$4:A$1000,Gesamt!P$4:P$1000)","v":0},{"$f":"LOOKUP(A21,Gesamt!A$4:A$1000,Gesamt!Q$4:Q$1000)","v":0},{"$f":"LOOKUP(A21,Gesamt!A$4:A$1000,Gesamt!R$4:R$1000)","v":0},{"$f":"LOOKUP(A21,Gesamt!A$4:A$1000,Gesamt!S$4:S$1000)","v":0},{"$f":"LOOKUP(A21,Gesamt!A$4:A$1000,Gesamt!T$4:T$1000)","v":0},-1000,0]
[114,{"$f":"LOOKUP(A22,Gesamt!A$4:A$1000,Gesamt!B$4:B$1000)","v":"JUN"},{"$f":"LOOKUP(A22,Gesamt!A$4:A$1000,Gesamt!C$4:C$1000)","v":0},{"$f":"LOOKUP(A22,Gesamt!A$4:A$1000,Gesamt!D$4:D$1000)","v":"Wolff"},{"$f":"LOOKUP(A22,Gesamt!A$4:A$1000,Gesamt!E$4:E$1000)","v":"Sonja"},{"$f":"LOOKUP(A22,Gesamt!A$4:A$1000,Gesamt!F$4:F$1000)","v":"Overath"},{"$f":"LOOKUP(A22,Gesamt!A$4:A$1000,Gesamt!N$4:N$1000)","v":0},{"$f":"LOOKUP(A22,Gesamt!A$4:A$1000,Gesamt!O$4:O$1000)","v":0},{"$f":"LOOKUP(A22,Gesamt!A$4:A$1000,Gesamt!P$4:P$1000)","v":0},{"$f":"LOOKUP(A22,Gesamt!A$4:A$1000,Gesamt!Q$4:Q$1000)","v":0},{"$f":"LOOKUP(A22,Gesamt!A$4:A$1000,Gesamt!R$4:R$1000)","v":0},{"$f":"LOOKUP(A22,Gesamt!A$4:A$1000,Gesamt!S$4:S$1000)","v":0},{"$f":"LOOKUP(A22,Gesamt!A$4:A$1000,Gesamt!T$4:T$1000)","v":0},-1000,0]
[115,{"$f":"LOOKUP(A23,Gesamt!A$4:A$1000,Gesamt!B$4:B$1000)","v":"JUN"},{"$f":"LOOKUP(A23,Gesamt!A$4:A$1000,Gesamt!C$4:C$1000)","v":0},{"$f":"LOOKUP(A23,Gesamt!A$4:A$1000,Gesamt!D$4:D$1000)","v":"Schröder"},{"$f":"LOOKUP(A23,Gesamt!A$4:A$1000,Gesamt!E$4:E$1000)","v":"Alina"},{"$f":"LOOKUP(A23,Gesamt!A$4:A$1000,Gesamt!F$4:F$1000)","v":"Billerbeck"},{"$f":"LOOKUP(A23,Gesamt!A$4:A$1000,Gesamt!N$4:N$1000)","v":0},{"$f":"LOOKUP(A23,Gesamt!A$4:A$1000,Gesamt!O$4:O$1000)","v":0},{"$f":"LOOKUP(A23,Gesamt!A$4:A$1000,Gesamt!P$4:P$1000)","v":0},{"$f":"LOOKUP(A23,Gesamt!A$4:A$1000,Gesamt!Q$4:Q$1000)","v":0},{"$f":"LOOKUP(A23,Gesamt!A$4:A$1000,Gesamt!R$4:R$1000)","v":0},{"$f":"LOOKUP(A23,Gesamt!A$4:A$1000,Gesamt!S$4:S$1000)","v":0},{"$f":"LOOKUP(A23,Gesamt!A$4:A$1000,Gesamt!T$4:T$1000)","v":0},-1000,0]
[116,{"$f":"LOOKUP(A24,Gesamt!A$4:A$1000,Gesamt!B$4:B$1000)","v":"JUN"},{"$f":"LOOKUP(A24,Gesamt!A$4:A$1000,Gesamt!C$4:C$1000)","v":0},{"$f":"LOOKUP(A24,Gesamt!A$4:A$1000,Gesamt!D$4:D$1000)","v":"Tzschoekel"},{"$f":"LOOKUP(A24,Gesamt!A$4:A$1000,Gesamt!E$4:E$1000)","v":"Brian"},{"$f":"LOOKUP(A24,Gesamt!A$4:A$1000,Gesamt!F$4:F$1000)","v":"Mettingen"},{"$f":"LOOKUP(A24,Gesamt!A$4:A$1000,Gesamt!N$4:N$1000)","v":0},{"$f":"LOOKUP(A24,Gesamt!A$4:A$1000,Gesamt!O$4:O$1000)","v":0},{"$f":"LOOKUP(A24,Gesamt!A$4:A$1000,Gesamt!P$4:P$1000)","v":0},{"$f":"LOOKUP(A24,Gesamt!A$4:A$1000,Gesamt!Q$4:Q$1000)","v":0},{"$f":"LOOKUP(A24,Gesamt!A$4:A$1000,Gesamt!R$4:R$1000)","v":0},{"$f":"LOOKUP(A24,Gesamt!A$4:A$1000,Gesamt!S$4:S$1000)","v":0},{"$f":"LOOKUP(A24,Gesamt!A$4:A$1000,Gesamt!T$4:T$1000)","v":0},-1000,0]
[117,{"$f":"LOOKUP(A25,Gesamt!A$4:A$1000,Gesamt!B$4:B$1000)","v":"JUN"},{"$f":"LOOKUP(A25,Gesamt!A$4:A$1000,Gesamt!C$4:C$1000)","v":0},{"$f":"LOOKUP(A25,Gesamt!A$4:A$1000,Gesamt!D$4:D$1000)","v":"Tzschoekel"},{"$f":"LOOKUP(A25,Gesamt!A$4:A$1000,Gesamt!E$4:E$1000)","v":"Jolina"},{"$f":"LOOKUP(A25,Gesamt!A$4:A$1000,Gesamt!F$4:F$1000)","v":"Mettingen"},{"$f":"LOOKUP(A25,Gesamt!A$4:A$1000,Gesamt!N$4:N$1000)","v":0},{"$f":"LOOKUP(A25,Gesamt!A$4:A$1000,Gesamt!O$4:O$1000)","v":0},{"$f":"LOOKUP(A25,Gesamt!A$4:A$1000,Gesamt!P$4:P$1000)","v":0},{"$f":"LOOKUP(A25,Gesamt!A$4:A$1000,Gesamt!Q$4:Q$1000)","v":0},{"$f":"LOOKUP(A25,Gesamt!A$4:A$1000,Gesamt!R$4:R$1000)","v":0},{"$f":"LOOKUP(A25,Gesamt!A$4:A$1000,Gesamt!S$4:S$1000)","v":0},{"$f":"LOOKUP(A25,Gesamt!A$4:A$1000,Gesamt!T$4:T$1000)","v":0},-1000,0]
[118,{"$f":"LOOKUP(A26,Gesamt!A$4:A$1000,Gesamt!B$4:B$1000)","v":"JUN"},{"$f":"LOOKUP(A26,Gesamt!A$4:A$1000,Gesamt!C$4:C$1000)","v":0},{"$f":"LOOKUP(A26,Gesamt!A$4:A$1000,Gesamt!D$4:D$1000)","v":"Allendorf"},{"$f":"LOOKUP(A26,Gesamt!A$4:A$1000,Gesamt!E$4:E$1000)","v":"Lucie"},{"$f":"LOOKUP(A26,Gesamt!A$4:A$1000,Gesamt!F$4:F$1000)","v":"Billerbeck"},{"$f":"LOOKUP(A26,Gesamt!A$4:A$1000,Gesamt!N$4:N$1000)","v":0},{"$f":"LOOKUP(A26,Gesamt!A$4:A$1000,Gesamt!O$4:O$1000)","v":0},{"$f":"LOOKUP(A26,Gesamt!A$4:A$1000,Gesamt!P$4:P$1000)","v":0},{"$f":"LOOKUP(A26,Gesamt!A$4:A$1000,Gesamt!Q$4:Q$1000)","v":0},{"$f":"LOOKUP(A26,Gesamt!A$4:A$1000,Gesamt!R$4:R$1000)","v":0},{"$f":"LOOKUP(A26,Gesamt!A$4:A$1000,Gesamt!S$4:S$1000)","v":0},{"$f":"LOOKUP(A26,Gesamt!A$4:A$1000,Gesamt!T$4:T$1000)","v":0},-1000,0]
[119,{"$f":"LOOKUP(A27,Gesamt!A$4:A$1000,Gesamt!B$4:B$1000)","v":"JUN"},{"$f":"LOOKUP(A27,Gesamt!A$4:A$1000,Gesamt!C$4:C$1000)","v":0},{"$f":"LOOKUP(A27,Gesamt!A$4:A$1000,Gesamt!D$4:D$1000)","v":"Löher"},{"$f":"LOOKUP(A27,Gesamt!A$4:A$1000,Gesamt!E$4:E$1000)","v":"Sören"},{"$f":"LOOKUP(A27,Gesamt!A$4:A$1000,Gesamt!F$4:F$1000)","v":"Stromberg"},{"$f":"LOOKUP(A27,Gesamt!A$4:A$1000,Gesamt!N$4:N$1000)","v":0},{"$f":"LOOKUP(A27,Gesamt!A$4:A$1000,Gesamt!O$4:O$1000)","v":0},{"$f":"LOOKUP(A27,Gesamt!A$4:A$1000,Gesamt!P$4:P$1000)","v":0},{"$f":"LOOKUP(A27,Gesamt!A$4:A$1000,Gesamt!Q$4:Q$1000)","v":0},{"$f":"LOOKUP(A27,Gesamt!A$4:A$1000,Gesamt!R$4:R$1000)","v":0},{"$f":"LOOKUP(A27,Gesamt!A$4:A$1000,Gesamt!S$4:S$1000)","v":0},{"$f":"LOOKUP(A27,Gesamt!A$4:A$1000,Gesamt!T$4:T$1000)","v":0},-1000,0]
[120,{"$f":"LOOKUP(A28,Gesamt!A$4:A$1000,Gesamt!B$4:B$1000)","v":"JUN"},{"$f":"LOOKUP(A28,Gesamt!A$4:A$1000,Gesamt!C$4:C$1000)","v":0},{"$f":"LOOKUP(A28,Gesamt!A$4:A$1000,Gesamt!D$4:D$1000)","v":"Suthe"},{"$f":"LOOKUP(A28,Gesamt!A$4:A$1000,Gesamt!E$4:E$1000)","v":"Phil"},{"$f":"LOOKUP(A28,Gesamt!A$4:A$1000,Gesamt!F$4:F$1000)","v":"Mettingen"},{"$f":"LOOKUP(A28,Gesamt!A$4:A$1000,Gesamt!N$4:N$1000)","v":0},{"$f":"LOOKUP(A28,Gesamt!A$4:A$1000,Gesamt!O$4:O$1000)","v":0},{"$f":"LOOKUP(A28,Gesamt!A$4:A$1000,Gesamt!P$4:P$1000)","v":0},{"$f":"LOOKUP(A28,Gesamt!A$4:A$1000,Gesamt!Q$4:Q$1000)","v":0},{"$f":"LOOKUP(A28,Gesamt!A$4:A$1000,Gesamt!R$4:R$1000)","v":0},{"$f":"LOOKUP(A28,Gesamt!A$4:A$1000,Gesamt!S$4:S$1000)","v":0},{"$f":"LOOKUP(A28,Gesamt!A$4:A$1000,Gesamt!T$4:T$1000)","v":0},-1000,0]
[121,{"$f":"LOOKUP(A29,Gesamt!A$4:A$1000,Gesamt!B$4:B$1000)","v":"JUN"},{"$f":"LOOKUP(A29,Gesamt!A$4:A$1000,Gesamt!C$4:C$1000)","v":0},{"$f":"LOOKUP(A29,Gesamt!A$4:A$1000,Gesamt!D$4:D$1000)","v":"Teeken"},{"$f":"LOOKUP(A29,Gesamt!A$4:A$1000,Gesamt!E$4:E$1000)","v":"Lukas"},{"$f":"LOOKUP(A29,Gesamt!A$4:A$1000,Gesamt!F$4:F$1000)","v":"Mettingen"},{"$f":"LOOKUP(A29,Gesamt!A$4:A$1000,Gesamt!N$4:N$1000)","v":0},{"$f":"LOOKUP(A29,Gesamt!A$4:A$1000,Gesamt!O$4:O$1000)","v":0},{"$f":"LOOKUP(A29,Gesamt!A$4:A$1000,Gesamt!P$4:P$1000)","v":0},{"$f":"LOOKUP(A29,Gesamt!A$4:A$1000,Gesamt!Q$4:Q$1000)","v":0},{"$f":"LOOKUP(A29,Gesamt!A$4:A$1000,Gesamt!R$4:R$1000)","v":0},{"$f":"LOOKUP(A29,Gesamt!A$4:A$1000,Gesamt!S$4:S$1000)","v":0},{"$f":"LOOKUP(A29,Gesamt!A$4:A$1000,Gesamt!T$4:T$1000)","v":0},-1000,0]
[122,{"$f":"LOOKUP(A30,Gesamt!A$4:A$1000,Gesamt!B$4:B$1000)","v":"JUN"},{"$f":"LOOKUP(A30,Gesamt!A$4:A$1000,Gesamt!C$4:C$1000)","v":0},{"$f":"LOOKUP(A30,Gesamt!A$4:A$1000,Gesamt!D$4:D$1000)","v":0},{"$f":"LOOKUP(A30,Gesamt!A$4:A$1000,Gesamt!E$4:E$1000)","v":0},{"$f":"LOOKUP(A30,Gesamt!A$4:A$1000,Gesamt!F$4:F$1000)","v":0},{"$f":"LOOKUP(A30,Gesamt!A$4:A$1000,Gesamt!N$4:N$1000)","v":0},{"$f":"LOOKUP(A30,Gesamt!A$4:A$1000,Gesamt!O$4:O$1000)","v":0},{"$f":"LOOKUP(A30,Gesamt!A$4:A$1000,Gesamt!P$4:P$1000)","v":0},{"$f":"LOOKUP(A30,Gesamt!A$4:A$1000,Gesamt!Q$4:Q$1000)","v":0},{"$f":"LOOKUP(A30,Gesamt!A$4:A$1000,Gesamt!R$4:R$1000)","v":0},{"$f":"LOOKUP(A30,Gesamt!A$4:A$1000,Gesamt!S$4:S$1000)","v":0},{"$f":"LOOKUP(A30,Gesamt!A$4:A$1000,Gesamt!T$4:T$1000)","v":0},-1000,0]
[123,{"$f":"LOOKUP(A31,Gesamt!A$4:A$1000,Gesamt!B$4:B$1000)","v":"JUN"},{"$f":"LOOKUP(A31,Gesamt!A$4:A$1000,Gesamt!C$4:C$1000)","v":0},{"$f":"LOOKUP(A31,Gesamt!A$4:A$1000,Gesamt!D$4:D$1000)","v":0},{"$f":"LOOKUP(A31,Gesamt!A$4:A$1000,Gesamt!E$4:E$1000)","v":0},{"$f":"LOOKUP(A31,Gesamt!A$4:A$1000,Gesamt!F$4:F$1000)","v":0},{"$f":"LOOKUP(A31,Gesamt!A$4:A$1000,Gesamt!N$4:N$1000)","v":0},{"$f":"LOOKUP(A31,Gesamt!A$4:A$1000,Gesamt!O$4:O$1000)","v":0},{"$f":"LOOKUP(A31,Gesamt!A$4:A$1000,Gesamt!P$4:P$1000)","v":0},{"$f":"LOOKUP(A31,Gesamt!A$4:A$1000,Gesamt!Q$4:Q$1000)","v":0},{"$f":"LOOKUP(A31,Gesamt!A$4:A$1000,Gesamt!R$4:R$1000)","v":0},{"$f":"LOOKUP(A31,Gesamt!A$4:A$1000,Gesamt!S$4:S$1000)","v":0},{"$f":"LOOKUP(A31,Gesamt!A$4:A$1000,Gesamt!T$4:T$1000)","v":0},-1000,0]
[124,{"$f":"LOOKUP(A32,Gesamt!A$4:A$1000,Gesamt!B$4:B$1000)","v":"JUN"},{"$f":"LOOKUP(A32,Gesamt!A$4:A$1000,Gesamt!C$4:C$1000)","v":0},{"$f":"LOOKUP(A32,Gesamt!A$4:A$1000,Gesamt!D$4:D$1000)","v":0},{"$f":"LOOKUP(A32,Gesamt!A$4:A$1000,Gesamt!E$4:E$1000)","v":0},{"$f":"LOOKUP(A32,Gesamt!A$4:A$1000,Gesamt!F$4:F$1000)","v":0},{"$f":"LOOKUP(A32,Gesamt!A$4:A$1000,Gesamt!N$4:N$1000)","v":0},{"$f":"LOOKUP(A32,Gesamt!A$4:A$1000,Gesamt!O$4:O$1000)","v":0},{"$f":"LOOKUP(A32,Gesamt!A$4:A$1000,Gesamt!P$4:P$1000)","v":0},{"$f":"LOOKUP(A32,Gesamt!A$4:A$1000,Gesamt!Q$4:Q$1000)","v":0},{"$f":"LOOKUP(A32,Gesamt!A$4:A$1000,Gesamt!R$4:R$1000)","v":0},{"$f":"LOOKUP(A32,Gesamt!A$4:A$1000,Gesamt!S$4:S$1000)","v":0},{"$f":"LOOKUP(A32,Gesamt!A$4:A$1000,Gesamt!T$4:T$1000)","v":0},-1000,0]
[125,{"$f":"LOOKUP(A33,Gesamt!A$4:A$1000,Gesamt!B$4:B$1000)","v":"JUN"},{"$f":"LOOKUP(A33,Gesamt!A$4:A$1000,Gesamt!C$4:C$1000)","v":0},{"$f":"LOOKUP(A33,Gesamt!A$4:A$1000,Gesamt!D$4:D$1000)","v":0},{"$f":"LOOKUP(A33,Gesamt!A$4:A$1000,Gesamt!E$4:E$1000)","v":0},{"$f":"LOOKUP(A33,Gesamt!A$4:A$1000,Gesamt!F$4:F$1000)","v":0},{"$f":"LOOKUP(A33,Gesamt!A$4:A$1000,Gesamt!N$4:N$1000)","v":0},{"$f":"LOOKUP(A33,Gesamt!A$4:A$1000,Gesamt!O$4:O$1000)","v":0},{"$f":"LOOKUP(A33,Gesamt!A$4:A$1000,Gesamt!P$4:P$1000)","v":0},{"$f":"LOOKUP(A33,Gesamt!A$4:A$1000,Gesamt!Q$4:Q$1000)","v":0},{"$f":"LOOKUP(A33,Gesamt!A$4:A$1000,Gesamt!R$4:R$1000)","v":0},{"$f":"LOOKUP(A33,Gesamt!A$4:A$1000,Gesamt!S$4:S$1000)","v":0},{"$f":"LOOKUP(A33,Gesamt!A$4:A$1000,Gesamt!T$4:T$1000)","v":0},-1000,0]
[126,{"$f":"LOOKUP(A34,Gesamt!A$4:A$1000,Gesamt!B$4:B$1000)","v":"JUN"},{"$f":"LOOKUP(A34,Gesamt!A$4:A$1000,Gesamt!C$4:C$1000)","v":0},{"$f":"LOOKUP(A34,Gesamt!A$4:A$1000,Gesamt!D$4:D$1000)","v":0},{"$f":"LOOKUP(A34,Gesamt!A$4:A$1000,Gesamt!E$4:E$1000)","v":0},{"$f":"LOOKUP(A34,Gesamt!A$4:A$1000,Gesamt!F$4:F$1000)","v":0},{"$f":"LOOKUP(A34,Gesamt!A$4:A$1000,Gesamt!N$4:N$1000)","v":0},{"$f":"LOOKUP(A34,Gesamt!A$4:A$1000,Gesamt!O$4:O$1000)","v":0},{"$f":"LOOKUP(A34,Gesamt!A$4:A$1000,Gesamt!P$4:P$1000)","v":0},{"$f":"LOOKUP(A34,Gesamt!A$4:A$1000,Gesamt!Q$4:Q$1000)","v":0},{"$f":"LOOKUP(A34,Gesamt!A$4:A$1000,Gesamt!R$4:R$1000)","v":0},{"$f":"LOOKUP(A34,Gesamt!A$4:A$1000,Gesamt!S$4:S$1000)","v":0},{"$f":"LOOKUP(A34,Gesamt!A$4:A$1000,Gesamt!T$4:T$1000)","v":0},-1000,0]
[127,{"$f":"LOOKUP(A35,Gesamt!A$4:A$1000,Gesamt!B$4:B$1000)","v":"JUN"},{"$f":"LOOKUP(A35,Gesamt!A$4:A$1000,Gesamt!C$4:C$1000)","v":0},{"$f":"LOOKUP(A35,Gesamt!A$4:A$1000,Gesamt!D$4:D$1000)","v":0},{"$f":"LOOKUP(A35,Gesamt!A$4:A$1000,Gesamt!E$4:E$1000)","v":0},{"$f":"LOOKUP(A35,Gesamt!A$4:A$1000,Gesamt!F$4:F$1000)","v":0},{"$f":"LOOKUP(A35,Gesamt!A$4:A$1000,Gesamt!N$4:N$1000)","v":0},{"$f":"LOOKUP(A35,Gesamt!A$4:A$1000,Gesamt!O$4:O$1000)","v":0},{"$f":"LOOKUP(A35,Gesamt!A$4:A$1000,Gesamt!P$4:P$1000)","v":0},{"$f":"LOOKUP(A35,Gesamt!A$4:A$1000,Gesamt!Q$4:Q$1000)","v":0},{"$f":"LOOKUP(A35,Gesamt!A$4:A$1000,Gesamt!R$4:R$1000)","v":0},{"$f":"LOOKUP(A35,Gesamt!A$4:A$1000,Gesamt!S$4:S$1000)","v":0},{"$f":"LOOKUP(A35,Gesamt!A$4:A$1000,Gesamt!T$4:T$1000)","v":0},-1000,0]
[128,{"$f":"LOOKUP(A36,Gesamt!A$4:A$1000,Gesamt!B$4:B$1000)","v":0},{"$f":"LOOKUP(A36,Gesamt!A$4:A$1000,Gesamt!C$4:C$1000)","v":0},{"$f":"LOOKUP(A36,Gesamt!A$4:A$1000,Gesamt!D$4:D$1000)","v":0},{"$f":"LOOKUP(A36,Gesamt!A$4:A$1000,Gesamt!E$4:E$1000)","v":0},{"$f":"LOOKUP(A36,Gesamt!A$4:A$1000,Gesamt!F$4:F$1000)","v":0},{"$f":"LOOKUP(A36,Gesamt!A$4:A$1000,Gesamt!N$4:N$1000)","v":0},{"$f":"LOOKUP(A36,Gesamt!A$4:A$1000,Gesamt!O$4:O$1000)","v":0},{"$f":"LOOKUP(A36,Gesamt!A$4:A$1000,Gesamt!P$4:P$1000)","v":0},{"$f":"LOOKUP(A36,Gesamt!A$4:A$1000,Gesamt!Q$4:Q$1000)","v":0},{"$f":"LOOKUP(A36,Gesamt!A$4:A$1000,Gesamt!R$4:R$1000)","v":0},{"$f":"LOOKUP(A36,Gesamt!A$4:A$1000,Gesamt!S$4:S$1000)","v":0},{"$f":"LOOKUP(A36,Gesamt!A$4:A$1000,Gesamt!T$4:T$1000)","v":0},-1000,0]
[129,{"$f":"LOOKUP(A37,Gesamt!A$4:A$1000,Gesamt!B$4:B$1000)","v":0},{"$f":"LOOKUP(A37,Gesamt!A$4:A$1000,Gesamt!C$4:C$1000)","v":0},{"$f":"LOOKUP(A37,Gesamt!A$4:A$1000,Gesamt!D$4:D$1000)","v":0},{"$f":"LOOKUP(A37,Gesamt!A$4:A$1000,Gesamt!E$4:E$1000)","v":0},{"$f":"LOOKUP(A37,Gesamt!A$4:A$1000,Gesamt!F$4:F$1000)","v":0},{"$f":"LOOKUP(A37,Gesamt!A$4:A$1000,Gesamt!N$4:N$1000)","v":0},{"$f":"LOOKUP(A37,Gesamt!A$4:A$1000,Gesamt!O$4:O$1000)","v":0},{"$f":"LOOKUP(A37,Gesamt!A$4:A$1000,Gesamt!P$4:P$1000)","v":0},{"$f":"LOOKUP(A37,Gesamt!A$4:A$1000,Gesamt!Q$4:Q$1000)","v":0},{"$f":"LOOKUP(A37,Gesamt!A$4:A$1000,Gesamt!R$4:R$1000)","v":0},{"$f":"LOOKUP(A37,Gesamt!A$4:A$1000,Gesamt!S$4:S$1000)","v":0},{"$f":"LOOKUP(A37,Gesamt!A$4:A$1000,Gesamt!T$4:T$1000)","v":0},-1000,0]
[130,{"$f":"LOOKUP(A38,Gesamt!A$4:A$1000,Gesamt!B$4:B$1000)","v":0},{"$f":"LOOKUP(A38,Gesamt!A$4:A$1000,Gesamt!C$4:C$1000)","v":0},{"$f":"LOOKUP(A38,Gesamt!A$4:A$1000,Gesamt!D$4:D$1000)","v":0},{"$f":"LOOKUP(A38,Gesamt!A$4:A$1000,Gesamt!E$4:E$1000)","v":0},{"$f":"LOOKUP(A38,Gesamt!A$4:A$1000,Gesamt!F$4:F$1000)","v":0},{"$f":"LOOKUP(A38,Gesamt!A$4:A$1000,Gesamt!N$4:N$1000)","v":0},{"$f":"LOOKUP(A38,Gesamt!A$4:A$1000,Gesamt!O$4:O$1000)","v":0},{"$f":"LOOKUP(A38,Gesamt!A$4:A$1000,Gesamt!P$4:P$1000)","v":0},{"$f":"LOOKUP(A38,Gesamt!A$4:A$1000,Gesamt!Q$4:Q$1000)","v":0},{"$f":"LOOKUP(A38,Gesamt!A$4:A$1000,Gesamt!R$4:R$1000)","v":0},{"$f":"LOOKUP(A38,Gesamt!A$4:A$1000,Gesamt!S$4:S$1000)","v":0},{"$f":"LOOKUP(A38,Gesamt!A$4:A$1000,Gesamt!T$4:T$1000)","v":0},-1000,0]
[131,{"$f":"LOOKUP(A39,Gesamt!A$4:A$1000,Gesamt!B$4:B$1000)","v":0},{"$f":"LOOKUP(A39,Gesamt!A$4:A$1000,Gesamt!C$4:C$1000)","v":0},{"$f":"LOOKUP(A39,Gesamt!A$4:A$1000,Gesamt!D$4:D$1000)","v":0},{"$f":"LOOKUP(A39,Gesamt!A$4:A$1000,Gesamt!E$4:E$1000)","v":0},{"$f":"LOOKUP(A39,Gesamt!A$4:A$1000,Gesamt!F$4:F$1000)","v":0},{"$f":"LOOKUP(A39,Gesamt!A$4:A$1000,Gesamt!N$4:N$1000)","v":0},{"$f":"LOOKUP(A39,Gesamt!A$4:A$1000,Gesamt!O$4:O$1000)","v":0},{"$f":"LOOKUP(A39,Gesamt!A$4:A$1000,Gesamt!P$4:P$1000)","v":0},{"$f":"LOOKUP(A39,Gesamt!A$4:A$1000,Gesamt!Q$4:Q$1000)","v":0},{"$f":"LOOKUP(A39,Gesamt!A$4:A$1000,Gesamt!R$4:R$1000)","v":0},{"$f":"LOOKUP(A39,Gesamt!A$4:A$1000,Gesamt!S$4:S$1000)","v":0},{"$f":"LOOKUP(A39,Gesamt!A$4:A$1000,Gesamt!T$4:T$1000)","v":0},-1000,0]
[132,{"$f":"LOOKUP(A40,Gesamt!A$4:A$1000,Gesamt!B$4:B$1000)","v":0},{"$f":"LOOKUP(A40,Gesamt!A$4:A$1000,Gesamt!C$4:C$1000)","v":0},{"$f":"LOOKUP(A40,Gesamt!A$4:A$1000,Gesamt!D$4:D$1000)","v":0},{"$f":"LOOKUP(A40,Gesamt!A$4:A$1000,Gesamt!E$4:E$1000)","v":0},{"$f":"LOOKUP(A40,Gesamt!A$4:A$1000,Gesamt!F$4:F$1000)","v":0},{"$f":"LOOKUP(A40,Gesamt!A$4:A$1000,Gesamt!N$4:N$1000)","v":0},{"$f":"LOOKUP(A40,Gesamt!A$4:A$1000,Gesamt!O$4:O$1000)","v":0},{"$f":"LOOKUP(A40,Gesamt!A$4:A$1000,Gesamt!P$4:P$1000)","v":0},{"$f":"LOOKUP(A40,Gesamt!A$4:A$1000,Gesamt!Q$4:Q$1000)","v":0},{"$f":"LOOKUP(A40,Gesamt!A$4:A$1000,Gesamt!R$4:R$1000)","v":0},{"$f":"LOOKUP(A40,Gesamt!A$4:A$1000,Gesamt!S$4:S$1000)","v":0},{"$f":"LOOKUP(A40,Gesamt!A$4:A$1000,Gesamt!T$4:T$1000)","v":0},-1000,0]
[133,{"$f":"LOOKUP(A41,Gesamt!A$4:A$1000,Gesamt!B$4:B$1000)","v":0},{"$f":"LOOKUP(A41,Gesamt!A$4:A$1000,Gesamt!C$4:C$1000)","v":0},{"$f":"LOOKUP(A41,Gesamt!A$4:A$1000,Gesamt!D$4:D$1000)","v":0},{"$f":"LOOKUP(A41,Gesamt!A$4:A$1000,Gesamt!E$4:E$1000)","v":0},{"$f":"LOOKUP(A41,Gesamt!A$4:A$1000,Gesamt!F$4:F$1000)","v":0},{"$f":"LOOKUP(A41,Gesamt!A$4:A$1000,Gesamt!N$4:N$1000)","v":0},{"$f":"LOOKUP(A41,Gesamt!A$4:A$1000,Gesamt!O$4:O$1000)","v":0},{"$f":"LOOKUP(A41,Gesamt!A$4:A$1000,Gesamt!P$4:P$1000)","v":0},{"$f":"LOOKUP(A41,Gesamt!A$4:A$1000,Gesamt!Q$4:Q$1000)","v":0},{"$f":"LOOKUP(A41,Gesamt!A$4:A$1000,Gesamt!R$4:R$1000)","v":0},{"$f":"LOOKUP(A41,Gesamt!A$4:A$1000,Gesamt!S$4:S$1000)","v":0},{"$f":"LOOKUP(A41,Gesamt!A$4:A$1000,Gesamt!T$4:T$1000)","v":0},{"$f":"IF(M41>0,M41*-1,-1000)","v":-1000},{"$f":"IF(M41>0,RANK(N41,N:N),0)","v":0}]
[134,{"$f":"LOOKUP(A42,Gesamt!A$4:A$1000,Gesamt!B$4:B$1000)","v":0},{"$f":"LOOKUP(A42,Gesamt!A$4:A$1000,Gesamt!C$4:C$1000)","v":0},{"$f":"LOOKUP(A42,Gesamt!A$4:A$1000,Gesamt!D$4:D$1000)","v":0},{"$f":"LOOKUP(A42,Gesamt!A$4:A$1000,Gesamt!E$4:E$1000)","v":0},{"$f":"LOOKUP(A42,Gesamt!A$4:A$1000,Gesamt!F$4:F$1000)","v":0},{"$f":"LOOKUP(A42,Gesamt!A$4:A$1000,Gesamt!N$4:N$1000)","v":0},{"$f":"LOOKUP(A42,Gesamt!A$4:A$1000,Gesamt!O$4:O$1000)","v":0},{"$f":"LOOKUP(A42,Gesamt!A$4:A$1000,Gesamt!P$4:P$1000)","v":0},{"$f":"LOOKUP(A42,Gesamt!A$4:A$1000,Gesamt!Q$4:Q$1000)","v":0},{"$f":"LOOKUP(A42,Gesamt!A$4:A$1000,Gesamt!R$4:R$1000)","v":0},{"$f":"LOOKUP(A42,Gesamt!A$4:A$1000,Gesamt!S$4:S$1000)","v":0},{"$f":"LOOKUP(A42,Gesamt!A$4:A$1000,Gesamt!T$4:T$1000)","v":0},-1000,0]
[135,{"$f":"LOOKUP(A43,Gesamt!A$4:A$1000,Gesamt!B$4:B$1000)","v":0},{"$f":"LOOKUP(A43,Gesamt!A$4:A$1000,Gesamt!C$4:C$1000)","v":0},{"$f":"LOOKUP(A43,Gesamt!A$4:A$1000,Gesamt!D$4:D$1000)","v":0},{"$f":"LOOKUP(A43,Gesamt!A$4:A$1000,Gesamt!E$4:E$1000)","v":0},{"$f":"LOOKUP(A43,Gesamt!A$4:A$1000,Gesamt!F$4:F$1000)","v":0},{"$f":"LOOKUP(A43,Gesamt!A$4:A$1000,Gesamt!N$4:N$1000)","v":0},{"$f":"LOOKUP(A43,Gesamt!A$4:A$1000,Gesamt!O$4:O$1000)","v":0},{"$f":"LOOKUP(A43,Gesamt!A$4:A$1000,Gesamt!P$4:P$1000)","v":0},{"$f":"LOOKUP(A43,Gesamt!A$4:A$1000,Gesamt!Q$4:Q$1000)","v":0},{"$f":"LOOKUP(A43,Gesamt!A$4:A$1000,Gesamt!R$4:R$1000)","v":0},{"$f":"LOOKUP(A43,Gesamt!A$4:A$1000,Gesamt!S$4:S$1000)","v":0},{"$f":"LOOKUP(A43,Gesamt!A$4:A$1000,Gesamt!T$4:T$1000)","v":0},-1000,0]
[136,{"$f":"LOOKUP(A44,Gesamt!A$4:A$1000,Gesamt!B$4:B$1000)","v":0},{"$f":"LOOKUP(A44,Gesamt!A$4:A$1000,Gesamt!C$4:C$1000)","v":0},{"$f":"LOOKUP(A44,Gesamt!A$4:A$1000,Gesamt!D$4:D$1000)","v":0},{"$f":"LOOKUP(A44,Gesamt!A$4:A$1000,Gesamt!E$4:E$1000)","v":0},{"$f":"LOOKUP(A44,Gesamt!A$4:A$1000,Gesamt!F$4:F$1000)","v":0},{"$f":"LOOKUP(A44,Gesamt!A$4:A$1000,Gesamt!N$4:N$1000)","v":0},{"$f":"LOOKUP(A44,Gesamt!A$4:A$1000,Gesamt!O$4:O$1000)","v":0},{"$f":"LOOKUP(A44,Gesamt!A$4:A$1000,Gesamt!P$4:P$1000)","v":0},{"$f":"LOOKUP(A44,Gesamt!A$4:A$1000,Gesamt!Q$4:Q$1000)","v":0},{"$f":"LOOKUP(A44,Gesamt!A$4:A$1000,Gesamt!R$4:R$1000)","v":0},{"$f":"LOOKUP(A44,Gesamt!A$4:A$1000,Gesamt!S$4:S$1000)","v":0},{"$f":"LOOKUP(A44,Gesamt!A$4:A$1000,Gesamt!T$4:T$1000)","v":0},-1000,0]
[137,{"$f":"LOOKUP(A45,Gesamt!A$4:A$1000,Gesamt!B$4:B$1000)","v":0},{"$f":"LOOKUP(A45,Gesamt!A$4:A$1000,Gesamt!C$4:C$1000)","v":0},{"$f":"LOOKUP(A45,Gesamt!A$4:A$1000,Gesamt!D$4:D$1000)","v":0},{"$f":"LOOKUP(A45,Gesamt!A$4:A$1000,Gesamt!E$4:E$1000)","v":0},{"$f":"LOOKUP(A45,Gesamt!A$4:A$1000,Gesamt!F$4:F$1000)","v":0},{"$f":"LOOKUP(A45,Gesamt!A$4:A$1000,Gesamt!N$4:N$1000)","v":0},{"$f":"LOOKUP(A45,Gesamt!A$4:A$1000,Gesamt!O$4:O$1000)","v":0},{"$f":"LOOKUP(A45,Gesamt!A$4:A$1000,Gesamt!P$4:P$1000)","v":0},{"$f":"LOOKUP(A45,Gesamt!A$4:A$1000,Gesamt!Q$4:Q$1000)","v":0},{"$f":"LOOKUP(A45,Gesamt!A$4:A$1000,Gesamt!R$4:R$1000)","v":0},{"$f":"LOOKUP(A45,Gesamt!A$4:A$1000,Gesamt!S$4:S$1000)","v":0},{"$f":"LOOKUP(A45,Gesamt!A$4:A$1000,Gesamt!T$4:T$1000)","v":0},-1000,0]
[138,{"$f":"LOOKUP(A46,Gesamt!A$4:A$1000,Gesamt!B$4:B$1000)","v":0},{"$f":"LOOKUP(A46,Gesamt!A$4:A$1000,Gesamt!C$4:C$1000)","v":0},{"$f":"LOOKUP(A46,Gesamt!A$4:A$1000,Gesamt!D$4:D$1000)","v":0},{"$f":"LOOKUP(A46,Gesamt!A$4:A$1000,Gesamt!E$4:E$1000)","v":0},{"$f":"LOOKUP(A46,Gesamt!A$4:A$1000,Gesamt!F$4:F$1000)","v":0},{"$f":"LOOKUP(A46,Gesamt!A$4:A$1000,Gesamt!N$4:N$1000)","v":0},{"$f":"LOOKUP(A46,Gesamt!A$4:A$1000,Gesamt!O$4:O$1000)","v":0},{"$f":"LOOKUP(A46,Gesamt!A$4:A$1000,Gesamt!P$4:P$1000)","v":0},{"$f":"LOOKUP(A46,Gesamt!A$4:A$1000,Gesamt!Q$4:Q$1000)","v":0},{"$f":"LOOKUP(A46,Gesamt!A$4:A$1000,Gesamt!R$4:R$1000)","v":0},{"$f":"LOOKUP(A46,Gesamt!A$4:A$1000,Gesamt!S$4:S$1000)","v":0},{"$f":"LOOKUP(A46,Gesamt!A$4:A$1000,Gesamt!T$4:T$1000)","v":0},-1000,0]
[139,{"$f":"LOOKUP(A47,Gesamt!A$4:A$1000,Gesamt!B$4:B$1000)","v":0},{"$f":"LOOKUP(A47,Gesamt!A$4:A$1000,Gesamt!C$4:C$1000)","v":0},{"$f":"LOOKUP(A47,Gesamt!A$4:A$1000,Gesamt!D$4:D$1000)","v":0},{"$f":"LOOKUP(A47,Gesamt!A$4:A$1000,Gesamt!E$4:E$1000)","v":0},{"$f":"LOOKUP(A47,Gesamt!A$4:A$1000,Gesamt!F$4:F$1000)","v":0},{"$f":"LOOKUP(A47,Gesamt!A$4:A$1000,Gesamt!N$4:N$1000)","v":0},{"$f":"LOOKUP(A47,Gesamt!A$4:A$1000,Gesamt!O$4:O$1000)","v":0},{"$f":"LOOKUP(A47,Gesamt!A$4:A$1000,Gesamt!P$4:P$1000)","v":0},{"$f":"LOOKUP(A47,Gesamt!A$4:A$1000,Gesamt!Q$4:Q$1000)","v":0},{"$f":"LOOKUP(A47,Gesamt!A$4:A$1000,Gesamt!R$4:R$1000)","v":0},{"$f":"LOOKUP(A47,Gesamt!A$4:A$1000,Gesamt!S$4:S$1000)","v":0},{"$f":"LOOKUP(A47,Gesamt!A$4:A$1000,Gesamt!T$4:T$1000)","v":0},-1000,0]
[140,{"$f":"LOOKUP(A48,Gesamt!A$4:A$1000,Gesamt!B$4:B$1000)","v":0},{"$f":"LOOKUP(A48,Gesamt!A$4:A$1000,Gesamt!C$4:C$1000)","v":0},{"$f":"LOOKUP(A48,Gesamt!A$4:A$1000,Gesamt!D$4:D$1000)","v":0},{"$f":"LOOKUP(A48,Gesamt!A$4:A$1000,Gesamt!E$4:E$1000)","v":0},{"$f":"LOOKUP(A48,Gesamt!A$4:A$1000,Gesamt!F$4:F$1000)","v":0},{"$f":"LOOKUP(A48,Gesamt!A$4:A$1000,Gesamt!N$4:N$1000)","v":0},{"$f":"LOOKUP(A48,Gesamt!A$4:A$1000,Gesamt!O$4:O$1000)","v":0},{"$f":"LOOKUP(A48,Gesamt!A$4:A$1000,Gesamt!P$4:P$1000)","v":0},{"$f":"LOOKUP(A48,Gesamt!A$4:A$1000,Gesamt!Q$4:Q$1000)","v":0},{"$f":"LOOKUP(A48,Gesamt!A$4:A$1000,Gesamt!R$4:R$1000)","v":0},{"$f":"LOOKUP(A48,Gesamt!A$4:A$1000,Gesamt!S$4:S$1000)","v":0},{"$f":"LOOKUP(A48,Gesamt!A$4:A$1000,Gesamt!T$4:T$1000)","v":0},-1000,0]
[141,{"$f":"LOOKUP(A49,Gesamt!A$4:A$1000,Gesamt!B$4:B$1000)","v":0},{"$f":"LOOKUP(A49,Gesamt!A$4:A$1000,Gesamt!C$4:C$1000)","v":0},{"$f":"LOOKUP(A49,Gesamt!A$4:A$1000,Gesamt!D$4:D$1000)","v":0},{"$f":"LOOKUP(A49,Gesamt!A$4:A$1000,Gesamt!E$4:E$1000)","v":0},{"$f":"LOOKUP(A49,Gesamt!A$4:A$1000,Gesamt!F$4:F$1000)","v":0},{"$f":"LOOKUP(A49,Gesamt!A$4:A$1000,Gesamt!N$4:N$1000)","v":0},{"$f":"LOOKUP(A49,Gesamt!A$4:A$1000,Gesamt!O$4:O$1000)","v":0},{"$f":"LOOKUP(A49,Gesamt!A$4:A$1000,Gesamt!P$4:P$1000)","v":0},{"$f":"LOOKUP(A49,Gesamt!A$4:A$1000,Gesamt!Q$4:Q$1000)","v":0},{"$f":"LOOKUP(A49,Gesamt!A$4:A$1000,Gesamt!R$4:R$1000)","v":0},{"$f":"LOOKUP(A49,Gesamt!A$4:A$1000,Gesamt!S$4:S$1000)","v":0},{"$f":"LOOKUP(A49,Gesamt!A$4:A$1000,Gesamt!T$4:T$1000)","v":0},-1000,0]
[142,{"$f":"LOOKUP(A50,Gesamt!A$4:A$1000,Gesamt!B$4:B$1000)","v":0},{"$f":"LOOKUP(A50,Gesamt!A$4:A$1000,Gesamt!C$4:C$1000)","v":0},{"$f":"LOOKUP(A50,Gesamt!A$4:A$1000,Gesamt!D$4:D$1000)","v":0},{"$f":"LOOKUP(A50,Gesamt!A$4:A$1000,Gesamt!E$4:E$1000)","v":0},{"$f":"LOOKUP(A50,Gesamt!A$4:A$1000,Gesamt!F$4:F$1000)","v":0},{"$f":"LOOKUP(A50,Gesamt!A$4:A$1000,Gesamt!N$4:N$1000)","v":0},{"$f":"LOOKUP(A50,Gesamt!A$4:A$1000,Gesamt!O$4:O$1000)","v":0},{"$f":"LOOKUP(A50,Gesamt!A$4:A$1000,Gesamt!P$4:P$1000)","v":0},{"$f":"LOOKUP(A50,Gesamt!A$4:A$1000,Gesamt!Q$4:Q$1000)","v":0},{"$f":"LOOKUP(A50,Gesamt!A$4:A$1000,Gesamt!R$4:R$1000)","v":0},{"$f":"LOOKUP(A50,Gesamt!A$4:A$1000,Gesamt!S$4:S$1000)","v":0},{"$f":"LOOKUP(A50,Gesamt!A$4:A$1000,Gesamt!T$4:T$1000)","v":0},-1000,0]
[143,{"$f":"LOOKUP(A51,Gesamt!A$4:A$1000,Gesamt!B$4:B$1000)","v":0},{"$f":"LOOKUP(A51,Gesamt!A$4:A$1000,Gesamt!C$4:C$1000)","v":0},{"$f":"LOOKUP(A51,Gesamt!A$4:A$1000,Gesamt!D$4:D$1000)","v":0},{"$f":"LOOKUP(A51,Gesamt!A$4:A$1000,Gesamt!E$4:E$1000)","v":0},{"$f":"LOOKUP(A51,Gesamt!A$4:A$1000,Gesamt!F$4:F$1000)","v":0},{"$f":"LOOKUP(A51,Gesamt!A$4:A$1000,Gesamt!N$4:N$1000)","v":0},{"$f":"LOOKUP(A51,Gesamt!A$4:A$1000,Gesamt!O$4:O$1000)","v":0},{"$f":"LOOKUP(A51,Gesamt!A$4:A$1000,Gesamt!P$4:P$1000)","v":0},{"$f":"LOOKUP(A51,Gesamt!A$4:A$1000,Gesamt!Q$4:Q$1000)","v":0},{"$f":"LOOKUP(A51,Gesamt!A$4:A$1000,Gesamt!R$4:R$1000)","v":0},{"$f":"LOOKUP(A51,Gesamt!A$4:A$1000,Gesamt!S$4:S$1000)","v":0},{"$f":"LOOKUP(A51,Gesamt!A$4:A$1000,Gesamt!T$4:T$1000)","v":0},-1000,0]
[144,{"$f":"LOOKUP(A52,Gesamt!A$4:A$1000,Gesamt!B$4:B$1000)","v":0},{"$f":"LOOKUP(A52,Gesamt!A$4:A$1000,Gesamt!C$4:C$1000)","v":0},{"$f":"LOOKUP(A52,Gesamt!A$4:A$1000,Gesamt!D$4:D$1000)","v":0},{"$f":"LOOKUP(A52,Gesamt!A$4:A$1000,Gesamt!E$4:E$1000)","v":0},{"$f":"LOOKUP(A52,Gesamt!A$4:A$1000,Gesamt!F$4:F$1000)","v":0},{"$f":"LOOKUP(A52,Gesamt!A$4:A$1000,Gesamt!N$4:N$1000)","v":0},{"$f":"LOOKUP(A52,Gesamt!A$4:A$1000,Gesamt!O$4:O$1000)","v":0},{"$f":"LOOKUP(A52,Gesamt!A$4:A$1000,Gesamt!P$4:P$1000)","v":0},{"$f":"LOOKUP(A52,Gesamt!A$4:A$1000,Gesamt!Q$4:Q$1000)","v":0},{"$f":"LOOKUP(A52,Gesamt!A$4:A$1000,Gesamt!R$4:R$1000)","v":0},{"$f":"LOOKUP(A52,Gesamt!A$4:A$1000,Gesamt!S$4:S$1000)","v":0},{"$f":"LOOKUP(A52,Gesamt!A$4:A$1000,Gesamt!T$4:T$1000)","v":0},-1000,0]
[145,{"$f":"LOOKUP(A53,Gesamt!A$4:A$1000,Gesamt!B$4:B$1000)","v":0},{"$f":"LOOKUP(A53,Gesamt!A$4:A$1000,Gesamt!C$4:C$1000)","v":0},{"$f":"LOOKUP(A53,Gesamt!A$4:A$1000,Gesamt!D$4:D$1000)","v":0},{"$f":"LOOKUP(A53,Gesamt!A$4:A$1000,Gesamt!E$4:E$1000)","v":0},{"$f":"LOOKUP(A53,Gesamt!A$4:A$1000,Gesamt!F$4:F$1000)","v":0},{"$f":"LOOKUP(A53,Gesamt!A$4:A$1000,Gesamt!N$4:N$1000)","v":0},{"$f":"LOOKUP(A53,Gesamt!A$4:A$1000,Gesamt!O$4:O$1000)","v":0},{"$f":"LOOKUP(A53,Gesamt!A$4:A$1000,Gesamt!P$4:P$1000)","v":0},{"$f":"LOOKUP(A53,Gesamt!A$4:A$1000,Gesamt!Q$4:Q$1000)","v":0},{"$f":"LOOKUP(A53,Gesamt!A$4:A$1000,Gesamt!R$4:R$1000)","v":0},{"$f":"LOOKUP(A53,Gesamt!A$4:A$1000,Gesamt!S$4:S$1000)","v":0},{"$f":"LOOKUP(A53,Gesamt!A$4:A$1000,Gesamt!T$4:T$1000)","v":0},-1000,0]
[146,{"$f":"LOOKUP(A54,Gesamt!A$4:A$1000,Gesamt!B$4:B$1000)","v":0},{"$f":"LOOKUP(A54,Gesamt!A$4:A$1000,Gesamt!C$4:C$1000)","v":0},{"$f":"LOOKUP(A54,Gesamt!A$4:A$1000,Gesamt!D$4:D$1000)","v":0},{"$f":"LOOKUP(A54,Gesamt!A$4:A$1000,Gesamt!E$4:E$1000)","v":0},{"$f":"LOOKUP(A54,Gesamt!A$4:A$1000,Gesamt!F$4:F$1000)","v":0},{"$f":"LOOKUP(A54,Gesamt!A$4:A$1000,Gesamt!N$4:N$1000)","v":0},{"$f":"LOOKUP(A54,Gesamt!A$4:A$1000,Gesamt!O$4:O$1000)","v":0},{"$f":"LOOKUP(A54,Gesamt!A$4:A$1000,Gesamt!P$4:P$1000)","v":0},{"$f":"LOOKUP(A54,Gesamt!A$4:A$1000,Gesamt!Q$4:Q$1000)","v":0},{"$f":"LOOKUP(A54,Gesamt!A$4:A$1000,Gesamt!R$4:R$1000)","v":0},{"$f":"LOOKUP(A54,Gesamt!A$4:A$1000,Gesamt!S$4:S$1000)","v":0},{"$f":"LOOKUP(A54,Gesamt!A$4:A$1000,Gesamt!T$4:T$1000)","v":0},-1000,0]
[147,{"$f":"LOOKUP(A55,Gesamt!A$4:A$1000,Gesamt!B$4:B$1000)","v":0},{"$f":"LOOKUP(A55,Gesamt!A$4:A$1000,Gesamt!C$4:C$1000)","v":0},{"$f":"LOOKUP(A55,Gesamt!A$4:A$1000,Gesamt!D$4:D$1000)","v":0},{"$f":"LOOKUP(A55,Gesamt!A$4:A$1000,Gesamt!E$4:E$1000)","v":0},{"$f":"LOOKUP(A55,Gesamt!A$4:A$1000,Gesamt!F$4:F$1000)","v":0},{"$f":"LOOKUP(A55,Gesamt!A$4:A$1000,Gesamt!N$4:N$1000)","v":0},{"$f":"LOOKUP(A55,Gesamt!A$4:A$1000,Gesamt!O$4:O$1000)","v":0},{"$f":"LOOKUP(A55,Gesamt!A$4:A$1000,Gesamt!P$4:P$1000)","v":0},{"$f":"LOOKUP(A55,Gesamt!A$4:A$1000,Gesamt!Q$4:Q$1000)","v":0},{"$f":"LOOKUP(A55,Gesamt!A$4:A$1000,Gesamt!R$4:R$1000)","v":0},{"$f":"LOOKUP(A55,Gesamt!A$4:A$1000,Gesamt!S$4:S$1000)","v":0},{"$f":"LOOKUP(A55,Gesamt!A$4:A$1000,Gesamt!T$4:T$1000)","v":0},-1000,0]
[148,{"$f":"LOOKUP(A56,Gesamt!A$4:A$1000,Gesamt!B$4:B$1000)","v":0},{"$f":"LOOKUP(A56,Gesamt!A$4:A$1000,Gesamt!C$4:C$1000)","v":0},{"$f":"LOOKUP(A56,Gesamt!A$4:A$1000,Gesamt!D$4:D$1000)","v":0},{"$f":"LOOKUP(A56,Gesamt!A$4:A$1000,Gesamt!E$4:E$1000)","v":0},{"$f":"LOOKUP(A56,Gesamt!A$4:A$1000,Gesamt!F$4:F$1000)","v":0},{"$f":"LOOKUP(A56,Gesamt!A$4:A$1000,Gesamt!N$4:N$1000)","v":0},{"$f":"LOOKUP(A56,Gesamt!A$4:A$1000,Gesamt!O$4:O$1000)","v":0},{"$f":"LOOKUP(A56,Gesamt!A$4:A$1000,Gesamt!P$4:P$1000)","v":0},{"$f":"LOOKUP(A56,Gesamt!A$4:A$1000,Gesamt!Q$4:Q$1000)","v":0},{"$f":"LOOKUP(A56,Gesamt!A$4:A$1000,Gesamt!R$4:R$1000)","v":0},{"$f":"LOOKUP(A56,Gesamt!A$4:A$1000,Gesamt!S$4:S$1000)","v":0},{"$f":"LOOKUP(A56,Gesamt!A$4:A$1000,Gesamt!T$4:T$1000)","v":0},-1000,0]
[149,{"$f":"LOOKUP(A57,Gesamt!A$4:A$1000,Gesamt!B$4:B$1000)","v":0},{"$f":"LOOKUP(A57,Gesamt!A$4:A$1000,Gesamt!C$4:C$1000)","v":0},{"$f":"LOOKUP(A57,Gesamt!A$4:A$1000,Gesamt!D$4:D$1000)","v":0},{"$f":"LOOKUP(A57,Gesamt!A$4:A$1000,Gesamt!E$4:E$1000)","v":0},{"$f":"LOOKUP(A57,Gesamt!A$4:A$1000,Gesamt!F$4:F$1000)","v":0},{"$f":"LOOKUP(A57,Gesamt!A$4:A$1000,Gesamt!N$4:N$1000)","v":0},{"$f":"LOOKUP(A57,Gesamt!A$4:A$1000,Gesamt!O$4:O$1000)","v":0},{"$f":"LOOKUP(A57,Gesamt!A$4:A$1000,Gesamt!P$4:P$1000)","v":0},{"$f":"LOOKUP(A57,Gesamt!A$4:A$1000,Gesamt!Q$4:Q$1000)","v":0},{"$f":"LOOKUP(A57,Gesamt!A$4:A$1000,Gesamt!R$4:R$1000)","v":0},{"$f":"LOOKUP(A57,Gesamt!A$4:A$1000,Gesamt!S$4:S$1000)","v":0},{"$f":"LOOKUP(A57,Gesamt!A$4:A$1000,Gesamt!T$4:T$1000)","v":0},-1000,0]
[150,{"$f":"LOOKUP(A58,Gesamt!A$4:A$1000,Gesamt!B$4:B$1000)","v":0},{"$f":"LOOKUP(A58,Gesamt!A$4:A$1000,Gesamt!C$4:C$1000)","v":0},{"$f":"LOOKUP(A58,Gesamt!A$4:A$1000,Gesamt!D$4:D$1000)","v":0},{"$f":"LOOKUP(A58,Gesamt!A$4:A$1000,Gesamt!E$4:E$1000)","v":0},{"$f":"LOOKUP(A58,Gesamt!A$4:A$1000,Gesamt!F$4:F$1000)","v":0},{"$f":"LOOKUP(A58,Gesamt!A$4:A$1000,Gesamt!N$4:N$1000)","v":0},{"$f":"LOOKUP(A58,Gesamt!A$4:A$1000,Gesamt!O$4:O$1000)","v":0},{"$f":"LOOKUP(A58,Gesamt!A$4:A$1000,Gesamt!P$4:P$1000)","v":0},{"$f":"LOOKUP(A58,Gesamt!A$4:A$1000,Gesamt!Q$4:Q$1000)","v":0},{"$f":"LOOKUP(A58,Gesamt!A$4:A$1000,Gesamt!R$4:R$1000)","v":0},{"$f":"LOOKUP(A58,Gesamt!A$4:A$1000,Gesamt!S$4:S$1000)","v":0},{"$f":"LOOKUP(A58,Gesamt!A$4:A$1000,Gesamt!T$4:T$1000)","v":0},-1000,0]
[151,{"$f":"LOOKUP(A59,Gesamt!A$4:A$1000,Gesamt!B$4:B$1000)","v":0},{"$f":"LOOKUP(A59,Gesamt!A$4:A$1000,Gesamt!C$4:C$1000)","v":0},{"$f":"LOOKUP(A59,Gesamt!A$4:A$1000,Gesamt!D$4:D$1000)","v":0},{"$f":"LOOKUP(A59,Gesamt!A$4:A$1000,Gesamt!E$4:E$1000)","v":0},{"$f":"LOOKUP(A59,Gesamt!A$4:A$1000,Gesamt!F$4:F$1000)","v":0},{"$f":"LOOKUP(A59,Gesamt!A$4:A$1000,Gesamt!N$4:N$1000)","v":0},{"$f":"LOOKUP(A59,Gesamt!A$4:A$1000,Gesamt!O$4:O$1000)","v":0},{"$f":"LOOKUP(A59,Gesamt!A$4:A$1000,Gesamt!P$4:P$1000)","v":0},{"$f":"LOOKUP(A59,Gesamt!A$4:A$1000,Gesamt!Q$4:Q$1000)","v":0},{"$f":"LOOKUP(A59,Gesamt!A$4:A$1000,Gesamt!R$4:R$1000)","v":0},{"$f":"LOOKUP(A59,Gesamt!A$4:A$1000,Gesamt!S$4:S$1000)","v":0},{"$f":"LOOKUP(A59,Gesamt!A$4:A$1000,Gesamt!T$4:T$1000)","v":0},-1000,0]
[152,{"$f":"LOOKUP(A60,Gesamt!A$4:A$1000,Gesamt!B$4:B$1000)","v":0},{"$f":"LOOKUP(A60,Gesamt!A$4:A$1000,Gesamt!C$4:C$1000)","v":0},{"$f":"LOOKUP(A60,Gesamt!A$4:A$1000,Gesamt!D$4:D$1000)","v":0},{"$f":"LOOKUP(A60,Gesamt!A$4:A$1000,Gesamt!E$4:E$1000)","v":0},{"$f":"LOOKUP(A60,Gesamt!A$4:A$1000,Gesamt!F$4:F$1000)","v":0},{"$f":"LOOKUP(A60,Gesamt!A$4:A$1000,Gesamt!N$4:N$1000)","v":0},{"$f":"LOOKUP(A60,Gesamt!A$4:A$1000,Gesamt!O$4:O$1000)","v":0},{"$f":"LOOKUP(A60,Gesamt!A$4:A$1000,Gesamt!P$4:P$1000)","v":0},{"$f":"LOOKUP(A60,Gesamt!A$4:A$1000,Gesamt!Q$4:Q$1000)","v":0},{"$f":"LOOKUP(A60,Gesamt!A$4:A$1000,Gesamt!R$4:R$1000)","v":0},{"$f":"LOOKUP(A60,Gesamt!A$4:A$1000,Gesamt!S$4:S$1000)","v":0},{"$f":"LOOKUP(A60,Gesamt!A$4:A$1000,Gesamt!T$4:T$1000)","v":0},-1000,0]
[153,{"$f":"LOOKUP(A61,Gesamt!A$4:A$1000,Gesamt!B$4:B$1000)","v":0},{"$f":"LOOKUP(A61,Gesamt!A$4:A$1000,Gesamt!C$4:C$1000)","v":0},{"$f":"LOOKUP(A61,Gesamt!A$4:A$1000,Gesamt!D$4:D$1000)","v":0},{"$f":"LOOKUP(A61,Gesamt!A$4:A$1000,Gesamt!E$4:E$1000)","v":0},{"$f":"LOOKUP(A61,Gesamt!A$4:A$1000,Gesamt!F$4:F$1000)","v":0},{"$f":"LOOKUP(A61,Gesamt!A$4:A$1000,Gesamt!N$4:N$1000)","v":0},{"$f":"LOOKUP(A61,Gesamt!A$4:A$1000,Gesamt!O$4:O$1000)","v":0},{"$f":"LOOKUP(A61,Gesamt!A$4:A$1000,Gesamt!P$4:P$1000)","v":0},{"$f":"LOOKUP(A61,Gesamt!A$4:A$1000,Gesamt!Q$4:Q$1000)","v":0},{"$f":"LOOKUP(A61,Gesamt!A$4:A$1000,Gesamt!R$4:R$1000)","v":0},{"$f":"LOOKUP(A61,Gesamt!A$4:A$1000,Gesamt!S$4:S$1000)","v":0},{"$f":"LOOKUP(A61,Gesamt!A$4:A$1000,Gesamt!T$4:T$1000)","v":0},-1000,0]
[154,{"$f":"LOOKUP(A62,Gesamt!A$4:A$1000,Gesamt!B$4:B$1000)","v":0},{"$f":"LOOKUP(A62,Gesamt!A$4:A$1000,Gesamt!C$4:C$1000)","v":0},{"$f":"LOOKUP(A62,Gesamt!A$4:A$1000,Gesamt!D$4:D$1000)","v":0},{"$f":"LOOKUP(A62,Gesamt!A$4:A$1000,Gesamt!E$4:E$1000)","v":0},{"$f":"LOOKUP(A62,Gesamt!A$4:A$1000,Gesamt!F$4:F$1000)","v":0},{"$f":"LOOKUP(A62,Gesamt!A$4:A$1000,Gesamt!N$4:N$1000)","v":0},{"$f":"LOOKUP(A62,Gesamt!A$4:A$1000,Gesamt!O$4:O$1000)","v":0},{"$f":"LOOKUP(A62,Gesamt!A$4:A$1000,Gesamt!P$4:P$1000)","v":0},{"$f":"LOOKUP(A62,Gesamt!A$4:A$1000,Gesamt!Q$4:Q$1000)","v":0},{"$f":"LOOKUP(A62,Gesamt!A$4:A$1000,Gesamt!R$4:R$1000)","v":0},{"$f":"LOOKUP(A62,Gesamt!A$4:A$1000,Gesamt!S$4:S$1000)","v":0},{"$f":"LOOKUP(A62,Gesamt!A$4:A$1000,Gesamt!T$4:T$1000)","v":0},-1000,0]
[155,{"$f":"LOOKUP(A63,Gesamt!A$4:A$1000,Gesamt!B$4:B$1000)","v":0},{"$f":"LOOKUP(A63,Gesamt!A$4:A$1000,Gesamt!C$4:C$1000)","v":0},{"$f":"LOOKUP(A63,Gesamt!A$4:A$1000,Gesamt!D$4:D$1000)","v":0},{"$f":"LOOKUP(A63,Gesamt!A$4:A$1000,Gesamt!E$4:E$1000)","v":0},{"$f":"LOOKUP(A63,Gesamt!A$4:A$1000,Gesamt!F$4:F$1000)","v":0},{"$f":"LOOKUP(A63,Gesamt!A$4:A$1000,Gesamt!N$4:N$1000)","v":0},{"$f":"LOOKUP(A63,Gesamt!A$4:A$1000,Gesamt!O$4:O$1000)","v":0},{"$f":"LOOKUP(A63,Gesamt!A$4:A$1000,Gesamt!P$4:P$1000)","v":0},{"$f":"LOOKUP(A63,Gesamt!A$4:A$1000,Gesamt!Q$4:Q$1000)","v":0},{"$f":"LOOKUP(A63,Gesamt!A$4:A$1000,Gesamt!R$4:R$1000)","v":0},{"$f":"LOOKUP(A63,Gesamt!A$4:A$1000,Gesamt!S$4:S$1000)","v":0},{"$f":"LOOKUP(A63,Gesamt!A$4:A$1000,Gesamt!T$4:T$1000)","v":0},-1000,0]
[156,{"$f":"LOOKUP(A64,Gesamt!A$4:A$1000,Gesamt!B$4:B$1000)","v":0},{"$f":"LOOKUP(A64,Gesamt!A$4:A$1000,Gesamt!C$4:C$1000)","v":0},{"$f":"LOOKUP(A64,Gesamt!A$4:A$1000,Gesamt!D$4:D$1000)","v":0},{"$f":"LOOKUP(A64,Gesamt!A$4:A$1000,Gesamt!E$4:E$1000)","v":0},{"$f":"LOOKUP(A64,Gesamt!A$4:A$1000,Gesamt!F$4:F$1000)","v":0},{"$f":"LOOKUP(A64,Gesamt!A$4:A$1000,Gesamt!N$4:N$1000)","v":0},{"$f":"LOOKUP(A64,Gesamt!A$4:A$1000,Gesamt!O$4:O$1000)","v":0},{"$f":"LOOKUP(A64,Gesamt!A$4:A$1000,Gesamt!P$4:P$1000)","v":0},{"$f":"LOOKUP(A64,Gesamt!A$4:A$1000,Gesamt!Q$4:Q$1000)","v":0},{"$f":"LOOKUP(A64,Gesamt!A$4:A$1000,Gesamt!R$4:R$1000)","v":0},{"$f":"LOOKUP(A64,Gesamt!A$4:A$1000,Gesamt!S$4:S$1000)","v":0},{"$f":"LOOKUP(A64,Gesamt!A$4:A$1000,Gesamt!T$4:T$1000)","v":0},-1000,0]
[157,{"$f":"LOOKUP(A65,Gesamt!A$4:A$1000,Gesamt!B$4:B$1000)","v":0},{"$f":"LOOKUP(A65,Gesamt!A$4:A$1000,Gesamt!C$4:C$1000)","v":0},{"$f":"LOOKUP(A65,Gesamt!A$4:A$1000,Gesamt!D$4:D$1000)","v":0},{"$f":"LOOKUP(A65,Gesamt!A$4:A$1000,Gesamt!E$4:E$1000)","v":0},{"$f":"LOOKUP(A65,Gesamt!A$4:A$1000,Gesamt!F$4:F$1000)","v":0},{"$f":"LOOKUP(A65,Gesamt!A$4:A$1000,Gesamt!N$4:N$1000)","v":0},{"$f":"LOOKUP(A65,Gesamt!A$4:A$1000,Gesamt!O$4:O$1000)","v":0},{"$f":"LOOKUP(A65,Gesamt!A$4:A$1000,Gesamt!P$4:P$1000)","v":0},{"$f":"LOOKUP(A65,Gesamt!A$4:A$1000,Gesamt!Q$4:Q$1000)","v":0},{"$f":"LOOKUP(A65,Gesamt!A$4:A$1000,Gesamt!R$4:R$1000)","v":0},{"$f":"LOOKUP(A65,Gesamt!A$4:A$1000,Gesamt!S$4:S$1000)","v":0},{"$f":"LOOKUP(A65,Gesamt!A$4:A$1000,Gesamt!T$4:T$1000)","v":0},-1000,0]
[158,{"$f":"LOOKUP(A66,Gesamt!A$4:A$1000,Gesamt!B$4:B$1000)","v":0},{"$f":"LOOKUP(A66,Gesamt!A$4:A$1000,Gesamt!C$4:C$1000)","v":0},{"$f":"LOOKUP(A66,Gesamt!A$4:A$1000,Gesamt!D$4:D$1000)","v":0},{"$f":"LOOKUP(A66,Gesamt!A$4:A$1000,Gesamt!E$4:E$1000)","v":0},{"$f":"LOOKUP(A66,Gesamt!A$4:A$1000,Gesamt!F$4:F$1000)","v":0},{"$f":"LOOKUP(A66,Gesamt!A$4:A$1000,Gesamt!N$4:N$1000)","v":0},{"$f":"LOOKUP(A66,Gesamt!A$4:A$1000,Gesamt!O$4:O$1000)","v":0},{"$f":"LOOKUP(A66,Gesamt!A$4:A$1000,Gesamt!P$4:P$1000)","v":0},{"$f":"LOOKUP(A66,Gesamt!A$4:A$1000,Gesamt!Q$4:Q$1000)","v":0},{"$f":"LOOKUP(A66,Gesamt!A$4:A$1000,Gesamt!R$4:R$1000)","v":0},{"$f":"LOOKUP(A66,Gesamt!A$4:A$1000,Gesamt!S$4:S$1000)","v":0},{"$f":"LOOKUP(A66,Gesamt!A$4:A$1000,Gesamt!T$4:T$1000)","v":0},-1000,0]
[159,{"$f":"LOOKUP(A67,Gesamt!A$4:A$1000,Gesamt!B$4:B$1000)","v":0},{"$f":"LOOKUP(A67,Gesamt!A$4:A$1000,Gesamt!C$4:C$1000)","v":0},{"$f":"LOOKUP(A67,Gesamt!A$4:A$1000,Gesamt!D$4:D$1000)","v":0},{"$f":"LOOKUP(A67,Gesamt!A$4:A$1000,Gesamt!E$4:E$1000)","v":0},{"$f":"LOOKUP(A67,Gesamt!A$4:A$1000,Gesamt!F$4:F$1000)","v":0},{"$f":"LOOKUP(A67,Gesamt!A$4:A$1000,Gesamt!N$4:N$1000)","v":0},{"$f":"LOOKUP(A67,Gesamt!A$4:A$1000,Gesamt!O$4:O$1000)","v":0},{"$f":"LOOKUP(A67,Gesamt!A$4:A$1000,Gesamt!P$4:P$1000)","v":0},{"$f":"LOOKUP(A67,Gesamt!A$4:A$1000,Gesamt!Q$4:Q$1000)","v":0},{"$f":"LOOKUP(A67,Gesamt!A$4:A$1000,Gesamt!R$4:R$1000)","v":0},{"$f":"LOOKUP(A67,Gesamt!A$4:A$1000,Gesamt!S$4:S$1000)","v":0},{"$f":"LOOKUP(A67,Gesamt!A$4:A$1000,Gesamt!T$4:T$1000)","v":0},-1000,0]
[160,{"$f":"LOOKUP(A68,Gesamt!A$4:A$1000,Gesamt!B$4:B$1000)","v":0},{"$f":"LOOKUP(A68,Gesamt!A$4:A$1000,Gesamt!C$4:C$1000)","v":0},{"$f":"LOOKUP(A68,Gesamt!A$4:A$1000,Gesamt!D$4:D$1000)","v":0},{"$f":"LOOKUP(A68,Gesamt!A$4:A$1000,Gesamt!E$4:E$1000)","v":0},{"$f":"LOOKUP(A68,Gesamt!A$4:A$1000,Gesamt!F$4:F$1000)","v":0},{"$f":"LOOKUP(A68,Gesamt!A$4:A$1000,Gesamt!N$4:N$1000)","v":0},{"$f":"LOOKUP(A68,Gesamt!A$4:A$1000,Gesamt!O$4:O$1000)","v":0},{"$f":"LOOKUP(A68,Gesamt!A$4:A$1000,Gesamt!P$4:P$1000)","v":0},{"$f":"LOOKUP(A68,Gesamt!A$4:A$1000,Gesamt!Q$4:Q$1000)","v":0},{"$f":"LOOKUP(A68,Gesamt!A$4:A$1000,Gesamt!R$4:R$1000)","v":0},{"$f":"LOOKUP(A68,Gesamt!A$4:A$1000,Gesamt!S$4:S$1000)","v":0},{"$f":"LOOKUP(A68,Gesamt!A$4:A$1000,Gesamt!T$4:T$1000)","v":0},-1000,0]
[161,{"$f":"LOOKUP(A69,Gesamt!A$4:A$1000,Gesamt!B$4:B$1000)","v":0},{"$f":"LOOKUP(A69,Gesamt!A$4:A$1000,Gesamt!C$4:C$1000)","v":0},{"$f":"LOOKUP(A69,Gesamt!A$4:A$1000,Gesamt!D$4:D$1000)","v":0},{"$f":"LOOKUP(A69,Gesamt!A$4:A$1000,Gesamt!E$4:E$1000)","v":0},{"$f":"LOOKUP(A69,Gesamt!A$4:A$1000,Gesamt!F$4:F$1000)","v":0},{"$f":"LOOKUP(A69,Gesamt!A$4:A$1000,Gesamt!N$4:N$1000)","v":0},{"$f":"LOOKUP(A69,Gesamt!A$4:A$1000,Gesamt!O$4:O$1000)","v":0},{"$f":"LOOKUP(A69,Gesamt!A$4:A$1000,Gesamt!P$4:P$1000)","v":0},{"$f":"LOOKUP(A69,Gesamt!A$4:A$1000,Gesamt!Q$4:Q$1000)","v":0},{"$f":"LOOKUP(A69,Gesamt!A$4:A$1000,Gesamt!R$4:R$1000)","v":0},{"$f":"LOOKUP(A69,Gesamt!A$4:A$1000,Gesamt!S$4:S$1000)","v":0},{"$f":"LOOKUP(A69,Gesamt!A$4:A$1000,Gesamt!T$4:T$1000)","v":0},-1000,0]
[162,{"$f":"LOOKUP(A70,Gesamt!A$4:A$1000,Gesamt!B$4:B$1000)","v":0},{"$f":"LOOKUP(A70,Gesamt!A$4:A$1000,Gesamt!C$4:C$1000)","v":0},{"$f":"LOOKUP(A70,Gesamt!A$4:A$1000,Gesamt!D$4:D$1000)","v":0},{"$f":"LOOKUP(A70,Gesamt!A$4:A$1000,Gesamt!E$4:E$1000)","v":0},{"$f":"LOOKUP(A70,Gesamt!A$4:A$1000,Gesamt!F$4:F$1000)","v":0},{"$f":"LOOKUP(A70,Gesamt!A$4:A$1000,Gesamt!N$4:N$1000)","v":0},{"$f":"LOOKUP(A70,Gesamt!A$4:A$1000,Gesamt!O$4:O$1000)","v":0},{"$f":"LOOKUP(A70,Gesamt!A$4:A$1000,Gesamt!P$4:P$1000)","v":0},{"$f":"LOOKUP(A70,Gesamt!A$4:A$1000,Gesamt!Q$4:Q$1000)","v":0},{"$f":"LOOKUP(A70,Gesamt!A$4:A$1000,Gesamt!R$4:R$1000)","v":0},{"$f":"LOOKUP(A70,Gesamt!A$4:A$1000,Gesamt!S$4:S$1000)","v":0},{"$f":"LOOKUP(A70,Gesamt!A$4:A$1000,Gesamt!T$4:T$1000)","v":0},-1000,0]
[163,{"$f":"LOOKUP(A71,Gesamt!A$4:A$1000,Gesamt!B$4:B$1000)","v":0},{"$f":"LOOKUP(A71,Gesamt!A$4:A$1000,Gesamt!C$4:C$1000)","v":0},{"$f":"LOOKUP(A71,Gesamt!A$4:A$1000,Gesamt!D$4:D$1000)","v":0},{"$f":"LOOKUP(A71,Gesamt!A$4:A$1000,Gesamt!E$4:E$1000)","v":0},{"$f":"LOOKUP(A71,Gesamt!A$4:A$1000,Gesamt!F$4:F$1000)","v":0},{"$f":"LOOKUP(A71,Gesamt!A$4:A$1000,Gesamt!N$4:N$1000)","v":0},{"$f":"LOOKUP(A71,Gesamt!A$4:A$1000,Gesamt!O$4:O$1000)","v":0},{"$f":"LOOKUP(A71,Gesamt!A$4:A$1000,Gesamt!P$4:P$1000)","v":0},{"$f":"LOOKUP(A71,Gesamt!A$4:A$1000,Gesamt!Q$4:Q$1000)","v":0},{"$f":"LOOKUP(A71,Gesamt!A$4:A$1000,Gesamt!R$4:R$1000)","v":0},{"$f":"LOOKUP(A71,Gesamt!A$4:A$1000,Gesamt!S$4:S$1000)","v":0},{"$f":"LOOKUP(A71,Gesamt!A$4:A$1000,Gesamt!T$4:T$1000)","v":0},-1000,0]
[164,{"$f":"LOOKUP(A72,Gesamt!A$4:A$1000,Gesamt!B$4:B$1000)","v":0},{"$f":"LOOKUP(A72,Gesamt!A$4:A$1000,Gesamt!C$4:C$1000)","v":0},{"$f":"LOOKUP(A72,Gesamt!A$4:A$1000,Gesamt!D$4:D$1000)","v":0},{"$f":"LOOKUP(A72,Gesamt!A$4:A$1000,Gesamt!E$4:E$1000)","v":0},{"$f":"LOOKUP(A72,Gesamt!A$4:A$1000,Gesamt!F$4:F$1000)","v":0},{"$f":"LOOKUP(A72,Gesamt!A$4:A$1000,Gesamt!N$4:N$1000)","v":0},{"$f":"LOOKUP(A72,Gesamt!A$4:A$1000,Gesamt!O$4:O$1000)","v":0},{"$f":"LOOKUP(A72,Gesamt!A$4:A$1000,Gesamt!P$4:P$1000)","v":0},{"$f":"LOOKUP(A72,Gesamt!A$4:A$1000,Gesamt!Q$4:Q$1000)","v":0},{"$f":"LOOKUP(A72,Gesamt!A$4:A$1000,Gesamt!R$4:R$1000)","v":0},{"$f":"LOOKUP(A72,Gesamt!A$4:A$1000,Gesamt!S$4:S$1000)","v":0},{"$f":"LOOKUP(A72,Gesamt!A$4:A$1000,Gesamt!T$4:T$1000)","v":0},-1000,0]
[165,{"$f":"LOOKUP(A73,Gesamt!A$4:A$1000,Gesamt!B$4:B$1000)","v":0},{"$f":"LOOKUP(A73,Gesamt!A$4:A$1000,Gesamt!C$4:C$1000)","v":0},{"$f":"LOOKUP(A73,Gesamt!A$4:A$1000,Gesamt!D$4:D$1000)","v":0},{"$f":"LOOKUP(A73,Gesamt!A$4:A$1000,Gesamt!E$4:E$1000)","v":0},{"$f":"LOOKUP(A73,Gesamt!A$4:A$1000,Gesamt!F$4:F$1000)","v":0},{"$f":"LOOKUP(A73,Gesamt!A$4:A$1000,Gesamt!N$4:N$1000)","v":0},{"$f":"LOOKUP(A73,Gesamt!A$4:A$1000,Gesamt!O$4:O$1000)","v":0},{"$f":"LOOKUP(A73,Gesamt!A$4:A$1000,Gesamt!P$4:P$1000)","v":0},{"$f":"LOOKUP(A73,Gesamt!A$4:A$1000,Gesamt!Q$4:Q$1000)","v":0},{"$f":"LOOKUP(A73,Gesamt!A$4:A$1000,Gesamt!R$4:R$1000)","v":0},{"$f":"LOOKUP(A73,Gesamt!A$4:A$1000,Gesamt!S$4:S$1000)","v":0},{"$f":"LOOKUP(A73,Gesamt!A$4:A$1000,Gesamt!T$4:T$1000)","v":0},{"$f":"IF(M73>0,M73*-1,-1000)","v":-1000},{"$f":"IF(M73>0,RANK(N73,N:N),0)","v":0}]
[166,{"$f":"LOOKUP(A74,Gesamt!A$4:A$1000,Gesamt!B$4:B$1000)","v":0},{"$f":"LOOKUP(A74,Gesamt!A$4:A$1000,Gesamt!C$4:C$1000)","v":0},{"$f":"LOOKUP(A74,Gesamt!A$4:A$1000,Gesamt!D$4:D$1000)","v":0},{"$f":"LOOKUP(A74,Gesamt!A$4:A$1000,Gesamt!E$4:E$1000)","v":0},{"$f":"LOOKUP(A74,Gesamt!A$4:A$1000,Gesamt!F$4:F$1000)","v":0},{"$f":"LOOKUP(A74,Gesamt!A$4:A$1000,Gesamt!N$4:N$1000)","v":0},{"$f":"LOOKUP(A74,Gesamt!A$4:A$1000,Gesamt!O$4:O$1000)","v":0},{"$f":"LOOKUP(A74,Gesamt!A$4:A$1000,Gesamt!P$4:P$1000)","v":0},{"$f":"LOOKUP(A74,Gesamt!A$4:A$1000,Gesamt!Q$4:Q$1000)","v":0},{"$f":"LOOKUP(A74,Gesamt!A$4:A$1000,Gesamt!R$4:R$1000)","v":0},{"$f":"LOOKUP(A74,Gesamt!A$4:A$1000,Gesamt!S$4:S$1000)","v":0},{"$f":"LOOKUP(A74,Gesamt!A$4:A$1000,Gesamt!T$4:T$1000)","v":0},-1000,0]
[167,{"$f":"LOOKUP(A75,Gesamt!A$4:A$1000,Gesamt!B$4:B$1000)","v":0},{"$f":"LOOKUP(A75,Gesamt!A$4:A$1000,Gesamt!C$4:C$1000)","v":0},{"$f":"LOOKUP(A75,Gesamt!A$4:A$1000,Gesamt!D$4:D$1000)","v":0},{"$f":"LOOKUP(A75,Gesamt!A$4:A$1000,Gesamt!E$4:E$1000)","v":0},{"$f":"LOOKUP(A75,Gesamt!A$4:A$1000,Gesamt!F$4:F$1000)","v":0},{"$f":"LOOKUP(A75,Gesamt!A$4:A$1000,Gesamt!N$4:N$1000)","v":0},{"$f":"LOOKUP(A75,Gesamt!A$4:A$1000,Gesamt!O$4:O$1000)","v":0},{"$f":"LOOKUP(A75,Gesamt!A$4:A$1000,Gesamt!P$4:P$1000)","v":0},{"$f":"LOOKUP(A75,Gesamt!A$4:A$1000,Gesamt!Q$4:Q$1000)","v":0},{"$f":"LOOKUP(A75,Gesamt!A$4:A$1000,Gesamt!R$4:R$1000)","v":0},{"$f":"LOOKUP(A75,Gesamt!A$4:A$1000,Gesamt!S$4:S$1000)","v":0},{"$f":"LOOKUP(A75,Gesamt!A$4:A$1000,Gesamt!T$4:T$1000)","v":0},-1000,0]
[168,{"$f":"LOOKUP(A76,Gesamt!A$4:A$1000,Gesamt!B$4:B$1000)","v":0},{"$f":"LOOKUP(A76,Gesamt!A$4:A$1000,Gesamt!C$4:C$1000)","v":0},{"$f":"LOOKUP(A76,Gesamt!A$4:A$1000,Gesamt!D$4:D$1000)","v":0},{"$f":"LOOKUP(A76,Gesamt!A$4:A$1000,Gesamt!E$4:E$1000)","v":0},{"$f":"LOOKUP(A76,Gesamt!A$4:A$1000,Gesamt!F$4:F$1000)","v":0},{"$f":"LOOKUP(A76,Gesamt!A$4:A$1000,Gesamt!N$4:N$1000)","v":0},{"$f":"LOOKUP(A76,Gesamt!A$4:A$1000,Gesamt!O$4:O$1000)","v":0},{"$f":"LOOKUP(A76,Gesamt!A$4:A$1000,Gesamt!P$4:P$1000)","v":0},{"$f":"LOOKUP(A76,Gesamt!A$4:A$1000,Gesamt!Q$4:Q$1000)","v":0},{"$f":"LOOKUP(A76,Gesamt!A$4:A$1000,Gesamt!R$4:R$1000)","v":0},{"$f":"LOOKUP(A76,Gesamt!A$4:A$1000,Gesamt!S$4:S$1000)","v":0},{"$f":"LOOKUP(A76,Gesamt!A$4:A$1000,Gesamt!T$4:T$1000)","v":0},-1000,0]
[169,{"$f":"LOOKUP(A77,Gesamt!A$4:A$1000,Gesamt!B$4:B$1000)","v":0},{"$f":"LOOKUP(A77,Gesamt!A$4:A$1000,Gesamt!C$4:C$1000)","v":0},{"$f":"LOOKUP(A77,Gesamt!A$4:A$1000,Gesamt!D$4:D$1000)","v":0},{"$f":"LOOKUP(A77,Gesamt!A$4:A$1000,Gesamt!E$4:E$1000)","v":0},{"$f":"LOOKUP(A77,Gesamt!A$4:A$1000,Gesamt!F$4:F$1000)","v":0},{"$f":"LOOKUP(A77,Gesamt!A$4:A$1000,Gesamt!N$4:N$1000)","v":0},{"$f":"LOOKUP(A77,Gesamt!A$4:A$1000,Gesamt!O$4:O$1000)","v":0},{"$f":"LOOKUP(A77,Gesamt!A$4:A$1000,Gesamt!P$4:P$1000)","v":0},{"$f":"LOOKUP(A77,Gesamt!A$4:A$1000,Gesamt!Q$4:Q$1000)","v":0},{"$f":"LOOKUP(A77,Gesamt!A$4:A$1000,Gesamt!R$4:R$1000)","v":0},{"$f":"LOOKUP(A77,Gesamt!A$4:A$1000,Gesamt!S$4:S$1000)","v":0},{"$f":"LOOKUP(A77,Gesamt!A$4:A$1000,Gesamt!T$4:T$1000)","v":0},-1000,0]
[170,{"$f":"LOOKUP(A78,Gesamt!A$4:A$1000,Gesamt!B$4:B$1000)","v":0},{"$f":"LOOKUP(A78,Gesamt!A$4:A$1000,Gesamt!C$4:C$1000)","v":0},{"$f":"LOOKUP(A78,Gesamt!A$4:A$1000,Gesamt!D$4:D$1000)","v":0},{"$f":"LOOKUP(A78,Gesamt!A$4:A$1000,Gesamt!E$4:E$1000)","v":0},{"$f":"LOOKUP(A78,Gesamt!A$4:A$1000,Gesamt!F$4:F$1000)","v":0},{"$f":"LOOKUP(A78,Gesamt!A$4:A$1000,Gesamt!N$4:N$1000)","v":0},{"$f":"LOOKUP(A78,Gesamt!A$4:A$1000,Gesamt!O$4:O$1000)","v":0},{"$f":"LOOKUP(A78,Gesamt!A$4:A$1000,Gesamt!P$4:P$1000)","v":0},{"$f":"LOOKUP(A78,Gesamt!A$4:A$1000,Gesamt!Q$4:Q$1000)","v":0},{"$f":"LOOKUP(A78,Gesamt!A$4:A$1000,Gesamt!R$4:R$1000)","v":0},{"$f":"LOOKUP(A78,Gesamt!A$4:A$1000,Gesamt!S$4:S$1000)","v":0},{"$f":"LOOKUP(A78,Gesamt!A$4:A$1000,Gesamt!T$4:T$1000)","v":0},-1000,0]
[171,{"$f":"LOOKUP(A79,Gesamt!A$4:A$1000,Gesamt!B$4:B$1000)","v":0},{"$f":"LOOKUP(A79,Gesamt!A$4:A$1000,Gesamt!C$4:C$1000)","v":0},{"$f":"LOOKUP(A79,Gesamt!A$4:A$1000,Gesamt!D$4:D$1000)","v":0},{"$f":"LOOKUP(A79,Gesamt!A$4:A$1000,Gesamt!E$4:E$1000)","v":0},{"$f":"LOOKUP(A79,Gesamt!A$4:A$1000,Gesamt!F$4:F$1000)","v":0},{"$f":"LOOKUP(A79,Gesamt!A$4:A$1000,Gesamt!N$4:N$1000)","v":0},{"$f":"LOOKUP(A79,Gesamt!A$4:A$1000,Gesamt!O$4:O$1000)","v":0},{"$f":"LOOKUP(A79,Gesamt!A$4:A$1000,Gesamt!P$4:P$1000)","v":0},{"$f":"LOOKUP(A79,Gesamt!A$4:A$1000,Gesamt!Q$4:Q$1000)","v":0},{"$f":"LOOKUP(A79,Gesamt!A$4:A$1000,Gesamt!R$4:R$1000)","v":0},{"$f":"LOOKUP(A79,Gesamt!A$4:A$1000,Gesamt!S$4:S$1000)","v":0},{"$f":"LOOKUP(A79,Gesamt!A$4:A$1000,Gesamt!T$4:T$1000)","v":0},-1000,0]
[172,{"$f":"LOOKUP(A80,Gesamt!A$4:A$1000,Gesamt!B$4:B$1000)","v":0},{"$f":"LOOKUP(A80,Gesamt!A$4:A$1000,Gesamt!C$4:C$1000)","v":0},{"$f":"LOOKUP(A80,Gesamt!A$4:A$1000,Gesamt!D$4:D$1000)","v":0},{"$f":"LOOKUP(A80,Gesamt!A$4:A$1000,Gesamt!E$4:E$1000)","v":0},{"$f":"LOOKUP(A80,Gesamt!A$4:A$1000,Gesamt!F$4:F$1000)","v":0},{"$f":"LOOKUP(A80,Gesamt!A$4:A$1000,Gesamt!N$4:N$1000)","v":0},{"$f":"LOOKUP(A80,Gesamt!A$4:A$1000,Gesamt!O$4:O$1000)","v":0},{"$f":"LOOKUP(A80,Gesamt!A$4:A$1000,Gesamt!P$4:P$1000)","v":0},{"$f":"LOOKUP(A80,Gesamt!A$4:A$1000,Gesamt!Q$4:Q$1000)","v":0},{"$f":"LOOKUP(A80,Gesamt!A$4:A$1000,Gesamt!R$4:R$1000)","v":0},{"$f":"LOOKUP(A80,Gesamt!A$4:A$1000,Gesamt!S$4:S$1000)","v":0},{"$f":"LOOKUP(A80,Gesamt!A$4:A$1000,Gesamt!T$4:T$1000)","v":0},-1000,0]
[173,{"$f":"LOOKUP(A81,Gesamt!A$4:A$1000,Gesamt!B$4:B$1000)","v":0},{"$f":"LOOKUP(A81,Gesamt!A$4:A$1000,Gesamt!C$4:C$1000)","v":0},{"$f":"LOOKUP(A81,Gesamt!A$4:A$1000,Gesamt!D$4:D$1000)","v":0},{"$f":"LOOKUP(A81,Gesamt!A$4:A$1000,Gesamt!E$4:E$1000)","v":0},{"$f":"LOOKUP(A81,Gesamt!A$4:A$1000,Gesamt!F$4:F$1000)","v":0},{"$f":"LOOKUP(A81,Gesamt!A$4:A$1000,Gesamt!N$4:N$1000)","v":0},{"$f":"LOOKUP(A81,Gesamt!A$4:A$1000,Gesamt!O$4:O$1000)","v":0},{"$f":"LOOKUP(A81,Gesamt!A$4:A$1000,Gesamt!P$4:P$1000)","v":0},{"$f":"LOOKUP(A81,Gesamt!A$4:A$1000,Gesamt!Q$4:Q$1000)","v":0},{"$f":"LOOKUP(A81,Gesamt!A$4:A$1000,Gesamt!R$4:R$1000)","v":0},{"$f":"LOOKUP(A81,Gesamt!A$4:A$1000,Gesamt!S$4:S$1000)","v":0},{"$f":"LOOKUP(A81,Gesamt!A$4:A$1000,Gesamt!T$4:T$1000)","v":0},-1000,0]
[174,{"$f":"LOOKUP(A82,Gesamt!A$4:A$1000,Gesamt!B$4:B$1000)","v":0},{"$f":"LOOKUP(A82,Gesamt!A$4:A$1000,Gesamt!C$4:C$1000)","v":0},{"$f":"LOOKUP(A82,Gesamt!A$4:A$1000,Gesamt!D$4:D$1000)","v":0},{"$f":"LOOKUP(A82,Gesamt!A$4:A$1000,Gesamt!E$4:E$1000)","v":0},{"$f":"LOOKUP(A82,Gesamt!A$4:A$1000,Gesamt!F$4:F$1000)","v":0},{"$f":"LOOKUP(A82,Gesamt!A$4:A$1000,Gesamt!N$4:N$1000)","v":0},{"$f":"LOOKUP(A82,Gesamt!A$4:A$1000,Gesamt!O$4:O$1000)","v":0},{"$f":"LOOKUP(A82,Gesamt!A$4:A$1000,Gesamt!P$4:P$1000)","v":0},{"$f":"LOOKUP(A82,Gesamt!A$4:A$1000,Gesamt!Q$4:Q$1000)","v":0},{"$f":"LOOKUP(A82,Gesamt!A$4:A$1000,Gesamt!R$4:R$1000)","v":0},{"$f":"LOOKUP(A82,Gesamt!A$4:A$1000,Gesamt!S$4:S$1000)","v":0},{"$f":"LOOKUP(A82,Gesamt!A$4:A$1000,Gesamt!T$4:T$1000)","v":0},-1000,0]
[175,{"$f":"LOOKUP(A83,Gesamt!A$4:A$1000,Gesamt!B$4:B$1000)","v":0},{"$f":"LOOKUP(A83,Gesamt!A$4:A$1000,Gesamt!C$4:C$1000)","v":0},{"$f":"LOOKUP(A83,Gesamt!A$4:A$1000,Gesamt!D$4:D$1000)","v":0},{"$f":"LOOKUP(A83,Gesamt!A$4:A$1000,Gesamt!E$4:E$1000)","v":0},{"$f":"LOOKUP(A83,Gesamt!A$4:A$1000,Gesamt!F$4:F$1000)","v":0},{"$f":"LOOKUP(A83,Gesamt!A$4:A$1000,Gesamt!N$4:N$1000)","v":0},{"$f":"LOOKUP(A83,Gesamt!A$4:A$1000,Gesamt!O$4:O$1000)","v":0},{"$f":"LOOKUP(A83,Gesamt!A$4:A$1000,Gesamt!P$4:P$1000)","v":0},{"$f":"LOOKUP(A83,Gesamt!A$4:A$1000,Gesamt!Q$4:Q$1000)","v":0},{"$f":"LOOKUP(A83,Gesamt!A$4:A$1000,Gesamt!R$4:R$1000)","v":0},{"$f":"LOOKUP(A83,Gesamt!A$4:A$1000,Gesamt!S$4:S$1000)","v":0},{"$f":"LOOKUP(A83,Gesamt!A$4:A$1000,Gesamt!T$4:T$1000)","v":0},-1000,0]
[176,{"$f":"LOOKUP(A84,Gesamt!A$4:A$1000,Gesamt!B$4:B$1000)","v":0},{"$f":"LOOKUP(A84,Gesamt!A$4:A$1000,Gesamt!C$4:C$1000)","v":0},{"$f":"LOOKUP(A84,Gesamt!A$4:A$1000,Gesamt!D$4:D$1000)","v":0},{"$f":"LOOKUP(A84,Gesamt!A$4:A$1000,Gesamt!E$4:E$1000)","v":0},{"$f":"LOOKUP(A84,Gesamt!A$4:A$1000,Gesamt!F$4:F$1000)","v":0},{"$f":"LOOKUP(A84,Gesamt!A$4:A$1000,Gesamt!N$4:N$1000)","v":0},{"$f":"LOOKUP(A84,Gesamt!A$4:A$1000,Gesamt!O$4:O$1000)","v":0},{"$f":"LOOKUP(A84,Gesamt!A$4:A$1000,Gesamt!P$4:P$1000)","v":0},{"$f":"LOOKUP(A84,Gesamt!A$4:A$1000,Gesamt!Q$4:Q$1000)","v":0},{"$f":"LOOKUP(A84,Gesamt!A$4:A$1000,Gesamt!R$4:R$1000)","v":0},{"$f":"LOOKUP(A84,Gesamt!A$4:A$1000,Gesamt!S$4:S$1000)","v":0},{"$f":"LOOKUP(A84,Gesamt!A$4:A$1000,Gesamt!T$4:T$1000)","v":0},-1000,0]
[177,{"$f":"LOOKUP(A85,Gesamt!A$4:A$1000,Gesamt!B$4:B$1000)","v":0},{"$f":"LOOKUP(A85,Gesamt!A$4:A$1000,Gesamt!C$4:C$1000)","v":0},{"$f":"LOOKUP(A85,Gesamt!A$4:A$1000,Gesamt!D$4:D$1000)","v":0},{"$f":"LOOKUP(A85,Gesamt!A$4:A$1000,Gesamt!E$4:E$1000)","v":0},{"$f":"LOOKUP(A85,Gesamt!A$4:A$1000,Gesamt!F$4:F$1000)","v":0},{"$f":"LOOKUP(A85,Gesamt!A$4:A$1000,Gesamt!N$4:N$1000)","v":0},{"$f":"LOOKUP(A85,Gesamt!A$4:A$1000,Gesamt!O$4:O$1000)","v":0},{"$f":"LOOKUP(A85,Gesamt!A$4:A$1000,Gesamt!P$4:P$1000)","v":0},{"$f":"LOOKUP(A85,Gesamt!A$4:A$1000,Gesamt!Q$4:Q$1000)","v":0},{"$f":"LOOKUP(A85,Gesamt!A$4:A$1000,Gesamt!R$4:R$1000)","v":0},{"$f":"LOOKUP(A85,Gesamt!A$4:A$1000,Gesamt!S$4:S$1000)","v":0},{"$f":"LOOKUP(A85,Gesamt!A$4:A$1000,Gesamt!T$4:T$1000)","v":0},-1000,0]
[178,{"$f":"LOOKUP(A86,Gesamt!A$4:A$1000,Gesamt!B$4:B$1000)","v":0},{"$f":"LOOKUP(A86,Gesamt!A$4:A$1000,Gesamt!C$4:C$1000)","v":0},{"$f":"LOOKUP(A86,Gesamt!A$4:A$1000,Gesamt!D$4:D$1000)","v":0},{"$f":"LOOKUP(A86,Gesamt!A$4:A$1000,Gesamt!E$4:E$1000)","v":0},{"$f":"LOOKUP(A86,Gesamt!A$4:A$1000,Gesamt!F$4:F$1000)","v":0},{"$f":"LOOKUP(A86,Gesamt!A$4:A$1000,Gesamt!N$4:N$1000)","v":0},{"$f":"LOOKUP(A86,Gesamt!A$4:A$1000,Gesamt!O$4:O$1000)","v":0},{"$f":"LOOKUP(A86,Gesamt!A$4:A$1000,Gesamt!P$4:P$1000)","v":0},{"$f":"LOOKUP(A86,Gesamt!A$4:A$1000,Gesamt!Q$4:Q$1000)","v":0},{"$f":"LOOKUP(A86,Gesamt!A$4:A$1000,Gesamt!R$4:R$1000)","v":0},{"$f":"LOOKUP(A86,Gesamt!A$4:A$1000,Gesamt!S$4:S$1000)","v":0},{"$f":"LOOKUP(A86,Gesamt!A$4:A$1000,Gesamt!T$4:T$1000)","v":0},-1000,0]
[179,{"$f":"LOOKUP(A87,Gesamt!A$4:A$1000,Gesamt!B$4:B$1000)","v":0},{"$f":"LOOKUP(A87,Gesamt!A$4:A$1000,Gesamt!C$4:C$1000)","v":0},{"$f":"LOOKUP(A87,Gesamt!A$4:A$1000,Gesamt!D$4:D$1000)","v":0},{"$f":"LOOKUP(A87,Gesamt!A$4:A$1000,Gesamt!E$4:E$1000)","v":0},{"$f":"LOOKUP(A87,Gesamt!A$4:A$1000,Gesamt!F$4:F$1000)","v":0},{"$f":"LOOKUP(A87,Gesamt!A$4:A$1000,Gesamt!N$4:N$1000)","v":0},{"$f":"LOOKUP(A87,Gesamt!A$4:A$1000,Gesamt!O$4:O$1000)","v":0},{"$f":"LOOKUP(A87,Gesamt!A$4:A$1000,Gesamt!P$4:P$1000)","v":0},{"$f":"LOOKUP(A87,Gesamt!A$4:A$1000,Gesamt!Q$4:Q$1000)","v":0},{"$f":"LOOKUP(A87,Gesamt!A$4:A$1000,Gesamt!R$4:R$1000)","v":0},{"$f":"LOOKUP(A87,Gesamt!A$4:A$1000,Gesamt!S$4:S$1000)","v":0},{"$f":"LOOKUP(A87,Gesamt!A$4:A$1000,Gesamt!T$4:T$1000)","v":0},-1000,0]
[180,{"$f":"LOOKUP(A88,Gesamt!A$4:A$1000,Gesamt!B$4:B$1000)","v":0},{"$f":"LOOKUP(A88,Gesamt!A$4:A$1000,Gesamt!C$4:C$1000)","v":0},{"$f":"LOOKUP(A88,Gesamt!A$4:A$1000,Gesamt!D$4:D$1000)","v":0},{"$f":"LOOKUP(A88,Gesamt!A$4:A$1000,Gesamt!E$4:E$1000)","v":0},{"$f":"LOOKUP(A88,Gesamt!A$4:A$1000,Gesamt!F$4:F$1000)","v":0},{"$f":"LOOKUP(A88,Gesamt!A$4:A$1000,Gesamt!N$4:N$1000)","v":0},{"$f":"LOOKUP(A88,Gesamt!A$4:A$1000,Gesamt!O$4:O$1000)","v":0},{"$f":"LOOKUP(A88,Gesamt!A$4:A$1000,Gesamt!P$4:P$1000)","v":0},{"$f":"LOOKUP(A88,Gesamt!A$4:A$1000,Gesamt!Q$4:Q$1000)","v":0},{"$f":"LOOKUP(A88,Gesamt!A$4:A$1000,Gesamt!R$4:R$1000)","v":0},{"$f":"LOOKUP(A88,Gesamt!A$4:A$1000,Gesamt!S$4:S$1000)","v":0},{"$f":"LOOKUP(A88,Gesamt!A$4:A$1000,Gesamt!T$4:T$1000)","v":0},-1000,0]
[181,{"$f":"LOOKUP(A89,Gesamt!A$4:A$1000,Gesamt!B$4:B$1000)","v":0},{"$f":"LOOKUP(A89,Gesamt!A$4:A$1000,Gesamt!C$4:C$1000)","v":0},{"$f":"LOOKUP(A89,Gesamt!A$4:A$1000,Gesamt!D$4:D$1000)","v":0},{"$f":"LOOKUP(A89,Gesamt!A$4:A$1000,Gesamt!E$4:E$1000)","v":0},{"$f":"LOOKUP(A89,Gesamt!A$4:A$1000,Gesamt!F$4:F$1000)","v":0},{"$f":"LOOKUP(A89,Gesamt!A$4:A$1000,Gesamt!N$4:N$1000)","v":0},{"$f":"LOOKUP(A89,Gesamt!A$4:A$1000,Gesamt!O$4:O$1000)","v":0},{"$f":"LOOKUP(A89,Gesamt!A$4:A$1000,Gesamt!P$4:P$1000)","v":0},{"$f":"LOOKUP(A89,Gesamt!A$4:A$1000,Gesamt!Q$4:Q$1000)","v":0},{"$f":"LOOKUP(A89,Gesamt!A$4:A$1000,Gesamt!R$4:R$1000)","v":0},{"$f":"LOOKUP(A89,Gesamt!A$4:A$1000,Gesamt!S$4:S$1000)","v":0},{"$f":"LOOKUP(A89,Gesamt!A$4:A$1000,Gesamt!T$4:T$1000)","v":0},-1000,0]
[182,{"$f":"LOOKUP(A90,Gesamt!A$4:A$1000,Gesamt!B$4:B$1000)","v":0},{"$f":"LOOKUP(A90,Gesamt!A$4:A$1000,Gesamt!C$4:C$1000)","v":0},{"$f":"LOOKUP(A90,Gesamt!A$4:A$1000,Gesamt!D$4:D$1000)","v":0},{"$f":"LOOKUP(A90,Gesamt!A$4:A$1000,Gesamt!E$4:E$1000)","v":0},{"$f":"LOOKUP(A90,Gesamt!A$4:A$1000,Gesamt!F$4:F$1000)","v":0},{"$f":"LOOKUP(A90,Gesamt!A$4:A$1000,Gesamt!N$4:N$1000)","v":0},{"$f":"LOOKUP(A90,Gesamt!A$4:A$1000,Gesamt!O$4:O$1000)","v":0},{"$f":"LOOKUP(A90,Gesamt!A$4:A$1000,Gesamt!P$4:P$1000)","v":0},{"$f":"LOOKUP(A90,Gesamt!A$4:A$1000,Gesamt!Q$4:Q$1000)","v":0},{"$f":"LOOKUP(A90,Gesamt!A$4:A$1000,Gesamt!R$4:R$1000)","v":0},{"$f":"LOOKUP(A90,Gesamt!A$4:A$1000,Gesamt!S$4:S$1000)","v":0},{"$f":"LOOKUP(A90,Gesamt!A$4:A$1000,Gesamt!T$4:T$1000)","v":0},-1000,0]
[183,{"$f":"LOOKUP(A91,Gesamt!A$4:A$1000,Gesamt!B$4:B$1000)","v":0},{"$f":"LOOKUP(A91,Gesamt!A$4:A$1000,Gesamt!C$4:C$1000)","v":0},{"$f":"LOOKUP(A91,Gesamt!A$4:A$1000,Gesamt!D$4:D$1000)","v":0},{"$f":"LOOKUP(A91,Gesamt!A$4:A$1000,Gesamt!E$4:E$1000)","v":0},{"$f":"LOOKUP(A91,Gesamt!A$4:A$1000,Gesamt!F$4:F$1000)","v":0},{"$f":"LOOKUP(A91,Gesamt!A$4:A$1000,Gesamt!N$4:N$1000)","v":0},{"$f":"LOOKUP(A91,Gesamt!A$4:A$1000,Gesamt!O$4:O$1000)","v":0},{"$f":"LOOKUP(A91,Gesamt!A$4:A$1000,Gesamt!P$4:P$1000)","v":0},{"$f":"LOOKUP(A91,Gesamt!A$4:A$1000,Gesamt!Q$4:Q$1000)","v":0},{"$f":"LOOKUP(A91,Gesamt!A$4:A$1000,Gesamt!R$4:R$1000)","v":0},{"$f":"LOOKUP(A91,Gesamt!A$4:A$1000,Gesamt!S$4:S$1000)","v":0},{"$f":"LOOKUP(A91,Gesamt!A$4:A$1000,Gesamt!T$4:T$1000)","v":0},-1000,0]
[184,{"$f":"LOOKUP(A92,Gesamt!A$4:A$1000,Gesamt!B$4:B$1000)","v":0},{"$f":"LOOKUP(A92,Gesamt!A$4:A$1000,Gesamt!C$4:C$1000)","v":0},{"$f":"LOOKUP(A92,Gesamt!A$4:A$1000,Gesamt!D$4:D$1000)","v":0},{"$f":"LOOKUP(A92,Gesamt!A$4:A$1000,Gesamt!E$4:E$1000)","v":0},{"$f":"LOOKUP(A92,Gesamt!A$4:A$1000,Gesamt!F$4:F$1000)","v":0},{"$f":"LOOKUP(A92,Gesamt!A$4:A$1000,Gesamt!N$4:N$1000)","v":0},{"$f":"LOOKUP(A92,Gesamt!A$4:A$1000,Gesamt!O$4:O$1000)","v":0},{"$f":"LOOKUP(A92,Gesamt!A$4:A$1000,Gesamt!P$4:P$1000)","v":0},{"$f":"LOOKUP(A92,Gesamt!A$4:A$1000,Gesamt!Q$4:Q$1000)","v":0},{"$f":"LOOKUP(A92,Gesamt!A$4:A$1000,Gesamt!R$4:R$1000)","v":0},{"$f":"LOOKUP(A92,Gesamt!A$4:A$1000,Gesamt!S$4:S$1000)","v":0},{"$f":"LOOKUP(A92,Gesamt!A$4:A$1000,Gesamt!T$4:T$1000)","v":0},-1000,0]
[185,{"$f":"LOOKUP(A93,Gesamt!A$4:A$1000,Gesamt!B$4:B$1000)","v":0},{"$f":"LOOKUP(A93,Gesamt!A$4:A$1000,Gesamt!C$4:C$1000)","v":0},{"$f":"LOOKUP(A93,Gesamt!A$4:A$1000,Gesamt!D$4:D$1000)","v":0},{"$f":"LOOKUP(A93,Gesamt!A$4:A$1000,Gesamt!E$4:E$1000)","v":0},{"$f":"LOOKUP(A93,Gesamt!A$4:A$1000,Gesamt!F$4:F$1000)","v":0},{"$f":"LOOKUP(A93,Gesamt!A$4:A$1000,Gesamt!N$4:N$1000)","v":0},{"$f":"LOOKUP(A93,Gesamt!A$4:A$1000,Gesamt!O$4:O$1000)","v":0},{"$f":"LOOKUP(A93,Gesamt!A$4:A$1000,Gesamt!P$4:P$1000)","v":0},{"$f":"LOOKUP(A93,Gesamt!A$4:A$1000,Gesamt!Q$4:Q$1000)","v":0},{"$f":"LOOKUP(A93,Gesamt!A$4:A$1000,Gesamt!R$4:R$1000)","v":0},{"$f":"LOOKUP(A93,Gesamt!A$4:A$1000,Gesamt!S$4:S$1000)","v":0},{"$f":"LOOKUP(A93,Gesamt!A$4:A$1000,Gesamt!T$4:T$1000)","v":0},-1000,0]
[186,{"$f":"LOOKUP(A94,Gesamt!A$4:A$1000,Gesamt!B$4:B$1000)","v":0},{"$f":"LOOKUP(A94,Gesamt!A$4:A$1000,Gesamt!C$4:C$1000)","v":0},{"$f":"LOOKUP(A94,Gesamt!A$4:A$1000,Gesamt!D$4:D$1000)","v":0},{"$f":"LOOKUP(A94,Gesamt!A$4:A$1000,Gesamt!E$4:E$1000)","v":0},{"$f":"LOOKUP(A94,Gesamt!A$4:A$1000,Gesamt!F$4:F$1000)","v":0},{"$f":"LOOKUP(A94,Gesamt!A$4:A$1000,Gesamt!N$4:N$1000)","v":0},{"$f":"LOOKUP(A94,Gesamt!A$4:A$1000,Gesamt!O$4:O$1000)","v":0},{"$f":"LOOKUP(A94,Gesamt!A$4:A$1000,Gesamt!P$4:P$1000)","v":0},{"$f":"LOOKUP(A94,Gesamt!A$4:A$1000,Gesamt!Q$4:Q$1000)","v":0},{"$f":"LOOKUP(A94,Gesamt!A$4:A$1000,Gesamt!R$4:R$1000)","v":0},{"$f":"LOOKUP(A94,Gesamt!A$4:A$1000,Gesamt!S$4:S$1000)","v":0},{"$f":"LOOKUP(A94,Gesamt!A$4:A$1000,Gesamt!T$4:T$1000)","v":0},-1000,0]
[187,{"$f":"LOOKUP(A95,Gesamt!A$4:A$1000,Gesamt!B$4:B$1000)","v":0},{"$f":"LOOKUP(A95,Gesamt!A$4:A$1000,Gesamt!C$4:C$1000)","v":0},{"$f":"LOOKUP(A95,Gesamt!A$4:A$1000,Gesamt!D$4:D$1000)","v":0},{"$f":"LOOKUP(A95,Gesamt!A$4:A$1000,Gesamt!E$4:E$1000)","v":0},{"$f":"LOOKUP(A95,Gesamt!A$4:A$1000,Gesamt!F$4:F$1000)","v":0},{"$f":"LOOKUP(A95,Gesamt!A$4:A$1000,Gesamt!N$4:N$1000)","v":0},{"$f":"LOOKUP(A95,Gesamt!A$4:A$1000,Gesamt!O$4:O$1000)","v":0},{"$f":"LOOKUP(A95,Gesamt!A$4:A$1000,Gesamt!P$4:P$1000)","v":0},{"$f":"LOOKUP(A95,Gesamt!A$4:A$1000,Gesamt!Q$4:Q$1000)","v":0},{"$f":"LOOKUP(A95,Gesamt!A$4:A$1000,Gesamt!R$4:R$1000)","v":0},{"$f":"LOOKUP(A95,Gesamt!A$4:A$1000,Gesamt!S$4:S$1000)","v":0},{"$f":"LOOKUP(A95,Gesamt!A$4:A$1000,Gesamt!T$4:T$1000)","v":0},-1000,0]
[188,{"$f":"LOOKUP(A96,Gesamt!A$4:A$1000,Gesamt!B$4:B$1000)","v":0},{"$f":"LOOKUP(A96,Gesamt!A$4:A$1000,Gesamt!C$4:C$1000)","v":0},{"$f":"LOOKUP(A96,Gesamt!A$4:A$1000,Gesamt!D$4:D$1000)","v":0},{"$f":"LOOKUP(A96,Gesamt!A$4:A$1000,Gesamt!E$4:E$1000)","v":0},{"$f":"LOOKUP(A96,Gesamt!A$4:A$1000,Gesamt!F$4:F$1000)","v":0},{"$f":"LOOKUP(A96,Gesamt!A$4:A$1000,Gesamt!N$4:N$1000)","v":0},{"$f":"LOOKUP(A96,Gesamt!A$4:A$1000,Gesamt!O$4:O$1000)","v":0},{"$f":"LOOKUP(A96,Gesamt!A$4:A$1000,Gesamt!P$4:P$1000)","v":0},{"$f":"LOOKUP(A96,Gesamt!A$4:A$1000,Gesamt!Q$4:Q$1000)","v":0},{"$f":"LOOKUP(A96,Gesamt!A$4:A$1000,Gesamt!R$4:R$1000)","v":0},{"$f":"LOOKUP(A96,Gesamt!A$4:A$1000,Gesamt!S$4:S$1000)","v":0},{"$f":"LOOKUP(A96,Gesamt!A$4:A$1000,Gesamt!T$4:T$1000)","v":0},-1000,0]
[189,{"$f":"LOOKUP(A97,Gesamt!A$4:A$1000,Gesamt!B$4:B$1000)","v":0},{"$f":"LOOKUP(A97,Gesamt!A$4:A$1000,Gesamt!C$4:C$1000)","v":0},{"$f":"LOOKUP(A97,Gesamt!A$4:A$1000,Gesamt!D$4:D$1000)","v":0},{"$f":"LOOKUP(A97,Gesamt!A$4:A$1000,Gesamt!E$4:E$1000)","v":0},{"$f":"LOOKUP(A97,Gesamt!A$4:A$1000,Gesamt!F$4:F$1000)","v":0},{"$f":"LOOKUP(A97,Gesamt!A$4:A$1000,Gesamt!N$4:N$1000)","v":0},{"$f":"LOOKUP(A97,Gesamt!A$4:A$1000,Gesamt!O$4:O$1000)","v":0},{"$f":"LOOKUP(A97,Gesamt!A$4:A$1000,Gesamt!P$4:P$1000)","v":0},{"$f":"LOOKUP(A97,Gesamt!A$4:A$1000,Gesamt!Q$4:Q$1000)","v":0},{"$f":"LOOKUP(A97,Gesamt!A$4:A$1000,Gesamt!R$4:R$1000)","v":0},{"$f":"LOOKUP(A97,Gesamt!A$4:A$1000,Gesamt!S$4:S$1000)","v":0},{"$f":"LOOKUP(A97,Gesamt!A$4:A$1000,Gesamt!T$4:T$1000)","v":0},-1000,0]
[190,{"$f":"LOOKUP(A98,Gesamt!A$4:A$1000,Gesamt!B$4:B$1000)","v":0},{"$f":"LOOKUP(A98,Gesamt!A$4:A$1000,Gesamt!C$4:C$1000)","v":0},{"$f":"LOOKUP(A98,Gesamt!A$4:A$1000,Gesamt!D$4:D$1000)","v":0},{"$f":"LOOKUP(A98,Gesamt!A$4:A$1000,Gesamt!E$4:E$1000)","v":0},{"$f":"LOOKUP(A98,Gesamt!A$4:A$1000,Gesamt!F$4:F$1000)","v":0},{"$f":"LOOKUP(A98,Gesamt!A$4:A$1000,Gesamt!N$4:N$1000)","v":0},{"$f":"LOOKUP(A98,Gesamt!A$4:A$1000,Gesamt!O$4:O$1000)","v":0},{"$f":"LOOKUP(A98,Gesamt!A$4:A$1000,Gesamt!P$4:P$1000)","v":0},{"$f":"LOOKUP(A98,Gesamt!A$4:A$1000,Gesamt!Q$4:Q$1000)","v":0},{"$f":"LOOKUP(A98,Gesamt!A$4:A$1000,Gesamt!R$4:R$1000)","v":0},{"$f":"LOOKUP(A98,Gesamt!A$4:A$1000,Gesamt!S$4:S$1000)","v":0},{"$f":"LOOKUP(A98,Gesamt!A$4:A$1000,Gesamt!T$4:T$1000)","v":0},-1000,0]
[191,{"$f":"LOOKUP(A99,Gesamt!A$4:A$1000,Gesamt!B$4:B$1000)","v":0},{"$f":"LOOKUP(A99,Gesamt!A$4:A$1000,Gesamt!C$4:C$1000)","v":0},{"$f":"LOOKUP(A99,Gesamt!A$4:A$1000,Gesamt!D$4:D$1000)","v":0},{"$f":"LOOKUP(A99,Gesamt!A$4:A$1000,Gesamt!E$4:E$1000)","v":0},{"$f":"LOOKUP(A99,Gesamt!A$4:A$1000,Gesamt!F$4:F$1000)","v":0},{"$f":"LOOKUP(A99,Gesamt!A$4:A$1000,Gesamt!N$4:N$1000)","v":0},{"$f":"LOOKUP(A99,Gesamt!A$4:A$1000,Gesamt!O$4:O$1000)","v":0},{"$f":"LOOKUP(A99,Gesamt!A$4:A$1000,Gesamt!P$4:P$1000)","v":0},{"$f":"LOOKUP(A99,Gesamt!A$4:A$1000,Gesamt!Q$4:Q$1000)","v":0},{"$f":"LOOKUP(A99,Gesamt!A$4:A$1000,Gesamt!R$4:R$1000)","v":0},{"$f":"LOOKUP(A99,Gesamt!A$4:A$1000,Gesamt!S$4:S$1000)","v":0},{"$f":"LOOKUP(A99,Gesamt!A$4:A$1000,Gesamt!T$4:T$1000)","v":0},-1000,0]
[192,{"$f":"LOOKUP(A100,Gesamt!A$4:A$1000,Gesamt!B$4:B$1000)","v":0},{"$f":"LOOKUP(A100,Gesamt!A$4:A$1000,Gesamt!C$4:C$1000)","v":0},{"$f":"LOOKUP(A100,Gesamt!A$4:A$1000,Gesamt!D$4:D$1000)","v":0},{"$f":"LOOKUP(A100,Gesamt!A$4:A$1000,Gesamt!E$4:E$1000)","v":0},{"$f":"LOOKUP(A100,Gesamt!A$4:A$1000,Gesamt!F$4:F$1000)","v":0},{"$f":"LOOKUP(A100,Gesamt!A$4:A$1000,Gesamt!N$4:N$1000)","v":0},{"$f":"LOOKUP(A100,Gesamt!A$4:A$1000,Gesamt!O$4:O$1000)","v":0},{"$f":"LOOKUP(A100,Gesamt!A$4:A$1000,Gesamt!P$4:P$1000)","v":0},{"$f":"LOOKUP(A100,Gesamt!A$4:A$1000,Gesamt!Q$4:Q$1000)","v":0},{"$f":"LOOKUP(A100,Gesamt!A$4:A$1000,Gesamt!R$4:R$1000)","v":0},{"$f":"LOOKUP(A100,Gesamt!A$4:A$1000,Gesamt!S$4:S$1000)","v":0},{"$f":"LOOKUP(A100,Gesamt!A$4:A$1000,Gesamt!T$4:T$1000)","v":0},-1000,0]
[193,{"$f":"LOOKUP(A101,Gesamt!A$4:A$1000,Gesamt!B$4:B$1000)","v":0},{"$f":"LOOKUP(A101,Gesamt!A$4:A$1000,Gesamt!C$4:C$1000)","v":0},{"$f":"LOOKUP(A101,Gesamt!A$4:A$1000,Gesamt!D$4:D$1000)","v":0},{"$f":"LOOKUP(A101,Gesamt!A$4:A$1000,Gesamt!E$4:E$1000)","v":0},{"$f":"LOOKUP(A101,Gesamt!A$4:A$1000,Gesamt!F$4:F$1000)","v":0},{"$f":"LOOKUP(A101,Gesamt!A$4:A$1000,Gesamt!N$4:N$1000)","v":0},{"$f":"LOOKUP(A101,Gesamt!A$4:A$1000,Gesamt!O$4:O$1000)","v":0},{"$f":"LOOKUP(A101,Gesamt!A$4:A$1000,Gesamt!P$4:P$1000)","v":0},{"$f":"LOOKUP(A101,Gesamt!A$4:A$1000,Gesamt!Q$4:Q$1000)","v":0},{"$f":"LOOKUP(A101,Gesamt!A$4:A$1000,Gesamt!R$4:R$1000)","v":0},{"$f":"LOOKUP(A101,Gesamt!A$4:A$1000,Gesamt!S$4:S$1000)","v":0},{"$f":"LOOKUP(A101,Gesamt!A$4:A$1000,Gesamt!T$4:T$1000)","v":0},-1000,0]
[194,{"$f":"LOOKUP(A102,Gesamt!A$4:A$1000,Gesamt!B$4:B$1000)","v":0},{"$f":"LOOKUP(A102,Gesamt!A$4:A$1000,Gesamt!C$4:C$1000)","v":0},{"$f":"LOOKUP(A102,Gesamt!A$4:A$1000,Gesamt!D$4:D$1000)","v":0},{"$f":"LOOKUP(A102,Gesamt!A$4:A$1000,Gesamt!E$4:E$1000)","v":0},{"$f":"LOOKUP(A102,Gesamt!A$4:A$1000,Gesamt!F$4:F$1000)","v":0},{"$f":"LOOKUP(A102,Gesamt!A$4:A$1000,Gesamt!N$4:N$1000)","v":0},{"$f":"LOOKUP(A102,Gesamt!A$4:A$1000,Gesamt!O$4:O$1000)","v":0},{"$f":"LOOKUP(A102,Gesamt!A$4:A$1000,Gesamt!P$4:P$1000)","v":0},{"$f":"LOOKUP(A102,Gesamt!A$4:A$1000,Gesamt!Q$4:Q$1000)","v":0},{"$f":"LOOKUP(A102,Gesamt!A$4:A$1000,Gesamt!R$4:R$1000)","v":0},{"$f":"LOOKUP(A102,Gesamt!A$4:A$1000,Gesamt!S$4:S$1000)","v":0},{"$f":"LOOKUP(A102,Gesamt!A$4:A$1000,Gesamt!T$4:T$1000)","v":0},-1000,0]
[195,{"$f":"LOOKUP(A103,Gesamt!A$4:A$1000,Gesamt!B$4:B$1000)","v":0},{"$f":"LOOKUP(A103,Gesamt!A$4:A$1000,Gesamt!C$4:C$1000)","v":0},{"$f":"LOOKUP(A103,Gesamt!A$4:A$1000,Gesamt!D$4:D$1000)","v":0},{"$f":"LOOKUP(A103,Gesamt!A$4:A$1000,Gesamt!E$4:E$1000)","v":0},{"$f":"LOOKUP(A103,Gesamt!A$4:A$1000,Gesamt!F$4:F$1000)","v":0},{"$f":"LOOKUP(A103,Gesamt!A$4:A$1000,Gesamt!N$4:N$1000)","v":0},{"$f":"LOOKUP(A103,Gesamt!A$4:A$1000,Gesamt!O$4:O$1000)","v":0},{"$f":"LOOKUP(A103,Gesamt!A$4:A$1000,Gesamt!P$4:P$1000)","v":0},{"$f":"LOOKUP(A103,Gesamt!A$4:A$1000,Gesamt!Q$4:Q$1000)","v":0},{"$f":"LOOKUP(A103,Gesamt!A$4:A$1000,Gesamt!R$4:R$1000)","v":0},{"$f":"LOOKUP(A103,Gesamt!A$4:A$1000,Gesamt!S$4:S$1000)","v":0},{"$f":"LOOKUP(A103,Gesamt!A$4:A$1000,Gesamt!T$4:T$1000)","v":0},-1000,0]
[196,{"$f":"LOOKUP(A104,Gesamt!A$4:A$1000,Gesamt!B$4:B$1000)","v":0},{"$f":"LOOKUP(A104,Gesamt!A$4:A$1000,Gesamt!C$4:C$1000)","v":0},{"$f":"LOOKUP(A104,Gesamt!A$4:A$1000,Gesamt!D$4:D$1000)","v":0},{"$f":"LOOKUP(A104,Gesamt!A$4:A$1000,Gesamt!E$4:E$1000)","v":0},{"$f":"LOOKUP(A104,Gesamt!A$4:A$1000,Gesamt!F$4:F$1000)","v":0},{"$f":"LOOKUP(A104,Gesamt!A$4:A$1000,Gesamt!N$4:N$1000)","v":0},{"$f":"LOOKUP(A104,Gesamt!A$4:A$1000,Gesamt!O$4:O$1000)","v":0},{"$f":"LOOKUP(A104,Gesamt!A$4:A$1000,Gesamt!P$4:P$1000)","v":0},{"$f":"LOOKUP(A104,Gesamt!A$4:A$1000,Gesamt!Q$4:Q$1000)","v":0},{"$f":"LOOKUP(A104,Gesamt!A$4:A$1000,Gesamt!R$4:R$1000)","v":0},{"$f":"LOOKUP(A104,Gesamt!A$4:A$1000,Gesamt!S$4:S$1000)","v":0},{"$f":"LOOKUP(A104,Gesamt!A$4:A$1000,Gesamt!T$4:T$1000)","v":0},-1000,0]
[197,{"$f":"LOOKUP(A105,Gesamt!A$4:A$1000,Gesamt!B$4:B$1000)","v":0},{"$f":"LOOKUP(A105,Gesamt!A$4:A$1000,Gesamt!C$4:C$1000)","v":0},{"$f":"LOOKUP(A105,Gesamt!A$4:A$1000,Gesamt!D$4:D$1000)","v":0},{"$f":"LOOKUP(A105,Gesamt!A$4:A$1000,Gesamt!E$4:E$1000)","v":0},{"$f":"LOOKUP(A105,Gesamt!A$4:A$1000,Gesamt!F$4:F$1000)","v":0},{"$f":"LOOKUP(A105,Gesamt!A$4:A$1000,Gesamt!N$4:N$1000)","v":0},{"$f":"LOOKUP(A105,Gesamt!A$4:A$1000,Gesamt!O$4:O$1000)","v":0},{"$f":"LOOKUP(A105,Gesamt!A$4:A$1000,Gesamt!P$4:P$1000)","v":0},{"$f":"LOOKUP(A105,Gesamt!A$4:A$1000,Gesamt!Q$4:Q$1000)","v":0},{"$f":"LOOKUP(A105,Gesamt!A$4:A$1000,Gesamt!R$4:R$1000)","v":0},{"$f":"LOOKUP(A105,Gesamt!A$4:A$1000,Gesamt!S$4:S$1000)","v":0},{"$f":"LOOKUP(A105,Gesamt!A$4:A$1000,Gesamt!T$4:T$1000)","v":0},{"$f":"IF(M105>0,M105*-1,-1000)","v":-1000},{"$f":"IF(M105>0,RANK(N105,N:N),0)","v":0}]
[198,{"$f":"LOOKUP(A106,Gesamt!A$4:A$1000,Gesamt!B$4:B$1000)","v":0},{"$f":"LOOKUP(A106,Gesamt!A$4:A$1000,Gesamt!C$4:C$1000)","v":0},{"$f":"LOOKUP(A106,Gesamt!A$4:A$1000,Gesamt!D$4:D$1000)","v":0},{"$f":"LOOKUP(A106,Gesamt!A$4:A$1000,Gesamt!E$4:E$1000)","v":0},{"$f":"LOOKUP(A106,Gesamt!A$4:A$1000,Gesamt!F$4:F$1000)","v":0},{"$f":"LOOKUP(A106,Gesamt!A$4:A$1000,Gesamt!N$4:N$1000)","v":0},{"$f":"LOOKUP(A106,Gesamt!A$4:A$1000,Gesamt!O$4:O$1000)","v":0},{"$f":"LOOKUP(A106,Gesamt!A$4:A$1000,Gesamt!P$4:P$1000)","v":0},{"$f":"LOOKUP(A106,Gesamt!A$4:A$1000,Gesamt!Q$4:Q$1000)","v":0},{"$f":"LOOKUP(A106,Gesamt!A$4:A$1000,Gesamt!R$4:R$1000)","v":0},{"$f":"LOOKUP(A106,Gesamt!A$4:A$1000,Gesamt!S$4:S$1000)","v":0},{"$f":"LOOKUP(A106,Gesamt!A$4:A$1000,Gesamt!T$4:T$1000)","v":0},-1000,0]
[199,{"$f":"LOOKUP(A107,Gesamt!A$4:A$1000,Gesamt!B$4:B$1000)","v":0},{"$f":"LOOKUP(A107,Gesamt!A$4:A$1000,Gesamt!C$4:C$1000)","v":0},{"$f":"LOOKUP(A107,Gesamt!A$4:A$1000,Gesamt!D$4:D$1000)","v":0},{"$f":"LOOKUP(A107,Gesamt!A$4:A$1000,Gesamt!E$4:E$1000)","v":0},{"$f":"LOOKUP(A107,Gesamt!A$4:A$1000,Gesamt!F$4:F$1000)","v":0},{"$f":"LOOKUP(A107,Gesamt!A$4:A$1000,Gesamt!N$4:N$1000)","v":0},{"$f":"LOOKUP(A107,Gesamt!A$4:A$1000,Gesamt!O$4:O$1000)","v":0},{"$f":"LOOKUP(A107,Gesamt!A$4:A$1000,Gesamt!P$4:P$1000)","v":0},{"$f":"LOOKUP(A107,Gesamt!A$4:A$1000,Gesamt!Q$4:Q$1000)","v":0},{"$f":"LOOKUP(A107,Gesamt!A$4:A$1000,Gesamt!R$4:R$1000)","v":0},{"$f":"LOOKUP(A107,Gesamt!A$4:A$1000,Gesamt!S$4:S$1000)","v":0},{"$f":"LOOKUP(A107,Gesamt!A$4:A$1000,Gesamt!T$4:T$1000)","v":0},-1000,0]

{"sheet":"Protokoll","index":5,"n_rows":39,"n_cols":11,"rows_kept":39,"cut":false,"hidden":false,"merged":[]}
[]
["Lauf\nNr",null,null,"Start\nUhrzeit",null,null,"Lauf\nNr",null,null,"Start\nUhrzeit"]
["Bahn 1",null,null,"Bahn 2",null,null,"Bahn 1",null,null,"Bahn 2"]
["Start\nNummer","Zeit",null,"Start\nNummer","Zeit",null,"Start\nNummer","Zeit",null,"Start\nNummer","Zeit"]
[null,null,null,null,null,1]
[null,null,null,null,null,2]
[null,null,null,null,null,3]
[null,null,null,null,null,4]
[null,null,null,null,null,5]
[null,null,null,null,null,6]
[null,null,null,null,null,7]
[null,null,null,null,null,8]
[null,null,null,null,null,9]
[null,null,null,null,null,10]
[null,null,null,null,null,11]
[null,null,null,null,null,12]
[null,null,null,null,null,13]
[null,null,null,null,null,14]
[null,null,null,null,null,15]
[null,null,null,null,null,16]
[null,null,null,null,null,17]
[null,null,null,null,null,18]
[null,null,null,null,null,19]
[null,null,null,null,null,20]
[null,null,null,null,null,21]
[null,null,null,null,null,22]
[null,null,null,null,null,23]
[null,null,null,null,null,24]
[null,null,null,null,null,25]
[null,null,null,null,null,26]
[null,null,null,null,null,27]
[null,null,null,null,null,28]
[null,null,null,null,null,29]
[null,null,null,null,null,30]
[null,null,null,null,null,31]
[null,null,null,null,null,32]
[null,null,null,null,null,33]
[null,null,null,null,null,34]
[null,null,null,null,null,35]

{"sheet":"Überschriften","index":6,"n_rows":12,"n_cols":4,"rows_kept":12,"cut":false,"hidden":false,"merged":[[0,1,0,3],[1,2,1,3]]}
[null,"Hier werden die Überschriften der automatischen Ergebnis-Listen definiert"]
[null,null,"09.06.2024    Derby in Mettingen"]
[null," ","für das Registerblatt \"Ergebnis\"","für das Registerblatt \"ErgebnisEndlauf\""]
[null,"Liste 100","NRW-Qualifikation JUNIOR - Klasse","Endlauf JUNIOR - Klasse"]
[null,"Liste 200","TüöttenCup","Endlauf Liste 200"]
[null,"Liste 300","NRW-Qualifikation SENIOR - Klasse","Endlauf SENIOR - Klasse"]
[null,"Liste 400","Liste 400","Endlauf Liste 400"]
[null,"Liste 500","NRW-Qualifikation Elite XL - Klasse","Endlauf Elite XL - Klasse"]
[null,"Liste 600","Liste 600","Endlauf Liste 600"]
[null,"Liste 700","NRW-Qualifikation Open - Klasse","Endlauf Elite XL ü18 - Klasse"]
[null,"Liste 800","Ortsderby Abc","Endlauf Liste 800"]
[null,"Liste 900",null,"Endlauf  Open - Klasse"]

{"sheet":"Versionen","index":7,"n_rows":7,"n_cols":2,"rows_kept":7,"cut":false,"hidden":false,"merged":[]}
[null,"Franz Tenambergen \nSeifenkisten Mettingen\n\nfranz.tenambergen@t-online.de\n0160 472 89 33\n\nbei Problemen oder Fragen gerne melden"]
["V9.1","3 Täler Rennen Mettingen\nneu nur 1 ErgebnissBlatt für alle Klassen\nErgebnisse werden über den AuswahlButton aus der Gesamtliste abgerufen"]
["V9.2","Sicherheitsüberprüfung ob bereits Zeiten für diesen Lauf eingetragen sind\nggf. würden Daten überschrieben"]
["V9.3","Vorbereitung auf Rennen in Seppenrade\nListe der 800 ist Ortsderby in Gleichmäßigkeitswertung"]
["V9.4","Vorbereitung auf Rennen in Mettingen 02.-04.06.2023\n"]
["V9.5","Vorbereitung auf Siegerurkunden\nBeiden Überschriften im Blatt \"Ergebnis\" a1 nach b1 verschoben"]
["V9.6","Vorbereitung auf Ortsderby Mettingen 2024"]

{"sheet":"Hinweise","index":8,"n_rows":26,"n_cols":2,"rows_kept":26,"cut":false,"hidden":false,"merged":[]}
[]
[null,"Hinweise zur Benutzung dieser Tabellen mit einem ALGE-Timer"]
[]
[]
[null,"Inbetriebnahme des ALGE-Timer"]
[]
[1,"Timer mit dem Seriellen-Kabel an die COM1 Schnittstelle anschließen"]
[2,"Kabel der Lichtschranken anschließen"]
[3,"Kippschalter auf \"C-timer\" stellen"]
[4,"Kippschalter nach oben auf \"programm + line test\" drücken und halten"]
[5,"EIN/AUS-Schalter auf Rückseite einschalten, nach 1 sec Kippschalter lösen"]
[6,"eventuell mit der gelben Taste drücken bis \"Pr.4\" angezeigt wird"]
[7,"um den Timer auf 0:00:00 zustellen rote und gelbe Taste gleichzeitig drücken"]
[8,"vor jeder neuen Messung wird so der Timer auf 0:00:00 gestellt"]
[9]
[10,"jetzt wird überprüft ob die Anzeige auch richtig mitläuft"]
[11,"Taste \"delay time\" 4x drücken"]
[12,"Anzeige LF  CH1-2          wenn zwischen LF und CH1-2  keine A steht dann"]
[13,"A einschalten durch Taster drücken auf \"program+line test\""]
[14,"um den Timer auf 0:00:00 zustellen rote und gelbe Taste gleichzeitig drücken"]
[15]
[16]
[17]
[18]
[19]
[20]